program: Orca
programVersion: 4.2.1
elementType: Cl O O N N N C C C C C C C C C C C C C C C C C C C H H H H H H H H H H H H H H H H H H H H H H H H
charge: 0
multiplicity: 1
keywords: wb97x-d3
keywords: def2-TZVPP
keywords: def2/J RIJCOSX GRIDX6 NOFINALGRIDX
keywords: grid4 nofinalgrid
keywords: scfconv7
keywords: smallprint printgap noloewdin
keywords: NOSOSCF
formula: C19H24ClN3O2
InChI: InChI=1S/C19H24ClN3O2/c1-18(2)13-25-19(3,23(18)17(24)22-12-11-21-14-22)10-4-5-15-6-8-16(20)9-7-15/h6-9,11-12,14H,4-5,10,13H2,1-3H3
49 atoms
Cl -6.621576 4.401231 1.050288
O  1.786176 0.807366 0.958318
O  1.008397 -3.098868 -0.134632
N  2.261938 -1.223887 0.105038
N  3.222688 -3.242537 -0.617188
N  4.969408 -4.57394 -0.477326
C  1.147088 -0.414044 0.679682
C  3.447391 -0.368591 -0.155842
C  2.773045 0.999299 -0.022985
C  0.027853 -0.211162 -0.351289
C  0.647646 -0.978299 1.998489
C  4.517259 -0.51643 0.922181
C  4.042696 -0.516597 -1.548448
C  -1.083769 0.715422 0.127211
C  2.067221 -2.51008 -0.195167
C  -2.103717 0.977576 -0.982428
C  -3.242941 1.832495 -0.50679
C  3.381235 -3.806011 -1.859266
C  4.193903 -3.762194 0.180771
C  -4.379463 1.257329 0.056128
C  -3.17366 3.221797 -0.570343
C  4.477847 -4.603972 -1.754094
C  -5.420815 2.036135 0.538057
C  -4.203886 4.019132 -0.09389
C  -5.322933 3.416031 0.457629
H  3.464362 1.772108 0.312434
H  2.342358 1.322909 -0.979242
H  -0.401637 -1.178916 -0.610296
H  0.459006 0.186962 -1.275329
H  1.481382 -1.266384 2.639644
H  0.00794 -1.845094 1.852621
H  0.067253 -0.223547 2.529107
H  5.280497 0.251356 0.786717
H  5.026228 -1.476554 0.871239
H  4.102151 -0.401738 1.924008
H  4.661688 0.358228 -1.757154
H  4.686778 -1.387941 -1.649553
H  3.270483 -0.561396 -2.317594
H  -1.601447 0.273917 0.982984
H  -0.670895 1.668259 0.468379
H  -2.488862 0.023414 -1.352099
H  -1.603981 1.460452 -1.826476
H  2.731534 -3.572814 -2.686249
H  4.260511 -3.533253 1.232958
H  -4.461538 0.178545 0.118346
H  -2.302074 3.697905 -1.004059
H  4.939357 -5.196209 -2.528713
H  -6.297325 1.569276 0.967112
H  -4.132792 5.096819 -0.156572
elementType: Cl O N C H
totalener: -1513.52376168 hartree
nucrepener: 2303.49910111 hartree
electener: -3817.02286279 hartree
oneelecener: -6643.68434453 hartree
twoeener: 2826.66148174 hartree
cpcmener: -0.03251553 hartree
kineticenergy: 1508.15538699 hartree
xcener: -124.303286497835 hartree
chargesum: -0.0000000
charge: -0.105929 -0.384888 -0.459606 -0.062311 -0.038146 -0.376596 0.367609 0.109939 0.059735 -0.268326 -0.326304 -0.348768 -0.335852 -0.136487 0.371962 -0.044674 0.021454 -0.151332 0.029264 -0.216152 -0.213525 -0.114892 -0.144460 -0.146848 0.084543 0.112232 0.083982 0.107850 0.085248 0.107394 0.110524 0.108872 0.107055 0.114051 0.114713 0.121194 0.104423 0.111079 0.087172 0.083248 0.089287 0.090951 0.183136 0.178750 0.139705 0.140147 0.165159 0.142425 0.141994
qa: -0.1059 -0.3849 -0.4596 -0.0623 -0.0381 -0.3766 0.3676 0.1099 0.0597 -0.2683 -0.3263 -0.3488 -0.3359 -0.1365 0.3720 -0.0447 0.0215 -0.1513 0.0293 -0.2162 -0.2135 -0.1149 -0.1445 -0.1468 0.0845 0.1122 0.0840 0.1078 0.0852 0.1074 0.1105 0.1089 0.1071 0.1141 0.1147 0.1212 0.1044 0.1111 0.0872 0.0832 0.0893 0.0910 0.1831 0.1788 0.1397 0.1401 0.1652 0.1424 0.1420
va: 1.1997 1.9710 2.0506 3.1694 3.2607 3.1071 3.9663 3.9363 3.9249 3.8886 3.9320 3.9507 3.9440 3.8215 4.2554 3.7545 3.5985 3.9136 4.0395 3.9811 3.9771 4.0114 3.9710 3.9734 3.8264 0.9917 1.0015 1.0346 1.0109 1.0081 1.0134 1.0013 1.0039 1.0021 1.0053 1.0036 0.9943 1.0011 1.0106 1.0344 1.0097 1.0094 0.9935 0.9869 1.0038 1.0041 1.0007 1.0051 1.0052
dispcorr: -0.027138002 hartree
energy: -1513.550899685872
dipole: 30.34302 -29.36908 0.97394 -8.56765 10.26256 1.69491 -4.41655 3.51959 -0.89696
magnitude: 2.15077 au
magnitude: 5.46682 debye
