program: Orca
programVersion: 4.2.1
elementType: Cl O O N N N C C C C C C C C C C C C C C C C C C C H H H H H H H H H H H H H H H H H H H H H H H H
charge: 0
multiplicity: 1
keywords: wb97x-d3
keywords: def2-TZVPP
keywords: def2/J RIJCOSX GRIDX6 NOFINALGRIDX
keywords: grid4 nofinalgrid
keywords: scfconv7
keywords: smallprint printgap noloewdin
keywords: NOSOSCF
formula: C19H24ClN3O2
InChI: InChI=1S/C19H24ClN3O2/c1-18(2)13-25-19(3,23(18)17(24)22-12-11-21-14-22)10-4-5-15-6-8-16(20)9-7-15/h6-9,11-12,14H,4-5,10,13H2,1-3H3
49 atoms
Cl -5.418903 -0.533648 1.178841
O  2.811835 1.393453 0.928003
O  2.969383 -2.594625 -0.978544
N  2.572694 -0.454028 -0.341585
N  0.806465 -1.960611 -0.73411
N  -1.044407 -3.113842 -0.436439
C  1.791039 0.554432 0.445649
C  3.994527 -0.044617 -0.432435
C  3.839832 1.418252 -0.030858
C  0.815963 1.349633 -0.431558
C  1.099385 -0.04788 1.65787
C  4.869916 -0.774439 0.58546
C  4.559297 -0.161396 -1.839182
C  0.379716 2.67704 0.186777
C  2.210244 -1.695182 -0.686292
C  -0.944123 3.177737 -0.402002
C  -2.098044 2.285828 -0.035179
C  -0.105388 -1.475356 -1.643223
C  0.190214 -2.966235 -0.055764
C  -2.688981 1.434008 -0.962593
C  -2.568683 2.252142 1.276841
C  -1.238943 -2.195895 -1.432482
C  -3.710938 0.56658 -0.601547
C  -3.587224 1.394407 1.658168
C  -4.148899 0.551819 0.71059
H  4.741905 1.824821 0.426489
H  3.581439 2.046975 -0.893479
H  -0.063083 0.728068 -0.601706
H  1.25389 1.538408 -1.415755
H  1.768321 -0.710286 2.20765
H  0.200741 -0.598683 1.390047
H  0.790035 0.74795 2.335534
H  4.915083 -1.843713 0.394246
H  4.511099 -0.62539 1.605199
H  5.889347 -0.387589 0.532711
H  5.495432 0.397767 -1.892699
H  4.778008 -1.18991 -2.118503
H  3.878637 0.262066 -2.579033
H  0.262496 2.588003 1.269658
H  1.147841 3.436396 0.02805
H  -0.862362 3.252897 -1.489463
H  -1.130651 4.190038 -0.034775
H  0.138265 -0.712073 -2.361966
H  0.693863 -3.528711 0.715609
H  -2.34875 1.437982 -1.991338
H  -2.134266 2.907428 2.02303
H  -2.179542 -2.107256 -1.952577
H  -4.154701 -0.08838 -1.33905
H  -3.936864 1.384948 2.681951
elementType: Cl O N C H
totalener: -1513.51957432 hartree
nucrepener: 2474.64912253 hartree
electener: -3988.16869685 hartree
oneelecener: -6986.29282269 hartree
twoeener: 2998.12412583 hartree
cpcmener: -0.03254370 hartree
kineticenergy: 1508.15538167 hartree
xcener: -124.305194105470 hartree
chargesum: 0.0000000
charge: -0.105658 -0.376704 -0.453522 -0.067684 -0.040816 -0.369662 0.335735 0.147795 0.051425 -0.174038 -0.349942 -0.351492 -0.321286 -0.176378 0.369283 -0.090662 0.089208 -0.142826 0.029268 -0.213590 -0.258568 -0.098394 -0.135757 -0.130340 0.087363 0.113909 0.082379 0.020598 0.110729 0.121915 0.102826 0.113350 0.108447 0.105889 0.104660 0.112237 0.108370 0.098855 0.088454 0.083328 0.086449 0.103451 0.191268 0.173888 0.141468 0.139645 0.152755 0.139911 0.142460
qa: -0.1057 -0.3767 -0.4535 -0.0677 -0.0408 -0.3697 0.3357 0.1478 0.0514 -0.1740 -0.3499 -0.3515 -0.3213 -0.1764 0.3693 -0.0907 0.0892 -0.1428 0.0293 -0.2136 -0.2586 -0.0984 -0.1358 -0.1303 0.0874 0.1139 0.0824 0.0206 0.1107 0.1219 0.1028 0.1133 0.1084 0.1059 0.1047 0.1122 0.1084 0.0989 0.0885 0.0833 0.0864 0.1035 0.1913 0.1739 0.1415 0.1396 0.1528 0.1399 0.1425
va: 1.2013 1.9628 2.0563 3.1248 3.2763 3.1191 3.9643 3.9251 3.9491 3.8957 3.9778 3.9317 3.9113 3.9375 4.2541 3.8476 3.5379 3.8884 4.0413 3.9129 3.9927 4.0387 3.9272 3.9600 3.8382 0.9928 0.9991 1.0381 1.0097 1.0028 0.9971 1.0087 1.0191 1.0072 1.0019 1.0000 1.0149 1.0055 1.0135 1.0196 1.0081 1.0035 0.9809 0.9991 1.0022 1.0038 1.0088 1.0050 1.0041
dispcorr: -0.031191511 hartree
energy: -1513.550765832787
dipole: 33.36552 -31.51244 1.85308 14.74242 -11.58872 3.15371 -4.01173 3.59761 -0.41412
magnitude: 3.68121 au
magnitude: 9.35688 debye
