program: Orca
programVersion: 4.2.1
elementType: Cl O O N N N C C C C C C C C C C C C C C C C C C C H H H H H H H H H H H H H H H H H H H H H H H H
charge: 0
multiplicity: 1
keywords: wb97x-d3
keywords: def2-TZVPP
keywords: def2/J RIJCOSX GRIDX6 NOFINALGRIDX
keywords: grid4 nofinalgrid
keywords: scfconv7
keywords: smallprint printgap noloewdin
keywords: NOSOSCF
formula: C19H24ClN3O2
InChI: InChI=1S/C19H24ClN3O2/c1-18(2)13-25-19(3,23(18)17(24)22-12-11-21-14-22)10-4-5-15-6-8-16(20)9-7-15/h6-9,11-12,14H,4-5,10,13H2,1-3H3
49 atoms
Cl -4.3942 2.379917 -2.92445
O  2.059297 1.475276 0.519184
O  1.705482 -2.418667 -1.554906
N  2.133473 -0.672647 -0.169671
N  1.294398 -2.714613 0.652428
N  0.040874 -4.160783 1.739358
C  1.754587 0.188462 1.000697
C  2.76715 0.150299 -1.228461
C  3.128938 1.366991 -0.385902
C  0.251276 0.147273 1.271081
C  2.590332 -0.093803 2.245043
C  4.017011 -0.490036 -1.810404
C  1.775149 0.545731 -2.321244
C  -0.24334 1.22849 2.225652
C  1.720781 -1.915126 -0.452016
C  -1.76942 1.208549 2.369446
C  -2.473026 1.500085 1.073425
C  2.057275 -3.181622 1.696551
C  0.099181 -3.362817 0.714771
C  -3.088505 0.492093 0.33756
C  -2.474977 2.790152 0.546389
C  1.261511 -4.068016 2.352691
C  -3.683403 0.750907 -0.889675
C  -3.062611 3.070222 -0.676925
C  -3.66166 2.042059 -1.388614
H  4.08858 1.227436 0.129469
H  3.18976 2.282627 -0.974177
H  -0.019488 -0.823255 1.68923
H  -0.265883 0.237216 0.31178
H  2.543536 0.766835 2.912767
H  3.638767 -0.26745 2.001411
H  2.224488 -0.952694 2.802472
H  4.681578 -0.851235 -1.024259
H  4.563986 0.258074 -2.387413
H  3.791731 -1.316872 -2.480289
H  0.912896 1.072806 -1.909923
H  2.262808 1.215454 -3.031652
H  1.414295 -0.316365 -2.877496
H  0.194129 1.08648 3.216803
H  0.068659 2.217384 1.88335
H  -2.056749 1.949373 3.119506
H  -2.089277 0.237011 2.754876
H  3.079133 -2.881474 1.850933
H  -0.686539 -3.185177 -0.003351
H  -3.104822 -0.521348 0.720878
H  -2.008268 3.598678 1.097021
H  1.506717 -4.647376 3.228962
H  -4.152876 -0.049252 -1.446194
H  -3.052311 4.078903 -1.067831
elementType: Cl O N C H
totalener: -1513.52091548 hartree
nucrepener: 2443.34142581 hartree
electener: -3956.86234129 hartree
oneelecener: -6923.68404984 hartree
twoeener: 2966.82170855 hartree
cpcmener: -0.03058189 hartree
kineticenergy: 1508.15627096 hartree
xcener: -124.304205105069 hartree
chargesum: -0.0000000
charge: -0.105988 -0.365517 -0.451037 -0.070618 -0.036313 -0.370864 0.259836 0.157638 0.061630 -0.216961 -0.348978 -0.319727 -0.355322 -0.137133 0.373500 -0.086279 0.018698 -0.157052 0.025917 -0.184540 -0.211276 -0.116814 -0.145012 -0.151941 0.092816 0.081152 0.109330 0.097809 0.103989 0.113280 0.113801 0.123122 0.098123 0.111917 0.108617 0.103197 0.107104 0.108958 0.086290 0.085416 0.104513 0.087892 0.194712 0.172630 0.137481 0.140105 0.165894 0.143399 0.142607
qa: -0.1060 -0.3655 -0.4510 -0.0706 -0.0363 -0.3709 0.2598 0.1576 0.0616 -0.2170 -0.3490 -0.3197 -0.3553 -0.1371 0.3735 -0.0863 0.0187 -0.1571 0.0259 -0.1845 -0.2113 -0.1168 -0.1450 -0.1519 0.0928 0.0812 0.1093 0.0978 0.1040 0.1133 0.1138 0.1231 0.0981 0.1119 0.1086 0.1032 0.1071 0.1090 0.0863 0.0854 0.1045 0.0879 0.1947 0.1726 0.1375 0.1401 0.1659 0.1434 0.1426
va: 1.1991 1.9656 2.0580 3.1132 3.2628 3.1156 4.0560 3.9170 3.9306 3.8535 3.9525 3.9051 3.9320 3.8763 4.2513 3.8287 3.5750 3.9159 4.0407 3.9185 3.9892 4.0413 3.9842 3.9817 3.8265 1.0018 0.9935 1.0120 1.0104 1.0087 1.0050 0.9953 1.0064 0.9999 1.0147 1.0062 1.0024 1.0187 1.0122 1.0279 1.0047 1.0119 0.9797 1.0006 1.0046 1.0032 1.0018 1.0044 1.0047
dispcorr: -0.029112035 hartree
energy: -1513.550027518501
dipole: 26.26490 -24.17213 2.09277 1.09978 0.84999 1.94977 13.68858 -12.40518 1.28340
magnitude: 3.13503 au
magnitude: 7.96861 debye
