program: Orca
programVersion: 4.2.1
elementType: Cl O O N N N C C C C C C C C C C C C C C C C C C C H H H H H H H H H H H H H H H H H H H H H H H H
charge: 0
multiplicity: 1
keywords: wb97x-d3
keywords: def2-TZVPP
keywords: def2/J RIJCOSX GRIDX6 NOFINALGRIDX
keywords: grid4 nofinalgrid
keywords: scfconv7
keywords: smallprint printgap noloewdin
keywords: NOSOSCF
formula: C19H24ClN3O2
InChI: InChI=1S/C19H24ClN3O2/c1-18(2)13-25-19(3,23(18)17(24)22-12-11-21-14-22)10-4-5-15-6-8-16(20)9-7-15/h6-9,11-12,14H,4-5,10,13H2,1-3H3
49 atoms
Cl -4.233693 1.194606 -2.779501
O  1.732459 1.403072 -0.549875
O  1.907403 -1.354916 2.515264
N  1.656359 -0.640379 0.375238
N  1.710309 -2.928591 0.889739
N  2.43857 -4.891586 0.212505
C  1.807107 0.804573 0.718615
C  1.11626 -0.789353 -1.004242
C  0.781924 0.6808 -1.287793
C  0.642276 1.265053 1.611152
C  3.166381 1.142296 1.297709
C  2.169653 -1.272797 -1.994772
C  -0.154296 -1.623022 -1.095236
C  0.460276 2.78215 1.671938
C  1.760521 -1.568038 1.330227
C  -1.004764 3.179588 1.901223
C  -1.881073 2.732709 0.763819
C  0.767082 -3.84721 1.27956
C  2.705679 -3.619468 0.271884
C  -1.811168 3.368008 -0.475045
C  -2.716483 1.625494 0.883117
C  1.226331 -5.045578 0.828923
C  -2.534919 2.909741 -1.564603
C  -3.445206 1.146364 -0.196862
C  -3.341889 1.791898 -1.417083
H  0.88294 0.932233 -2.343439
H  -0.243158 0.923322 -0.979421
H  0.781267 0.86975 2.61663
H  -0.273136 0.799843 1.237587
H  3.968994 0.741009 0.678126
H  3.282671 0.760846 2.308645
H  3.284453 2.225956 1.340397
H  2.433235 -2.31763 -1.845237
H  3.080865 -0.676418 -1.936333
H  1.778824 -1.188726 -3.009813
H  -0.864273 -1.363965 -0.307982
H  -0.640346 -1.416402 -2.050867
H  0.028817 -2.695232 -1.061021
H  1.070267 3.205949 2.472957
H  0.800634 3.252405 0.747217
H  -1.061435 4.265167 2.012015
H  -1.365262 2.750127 2.839303
H  -0.131954 -3.566336 1.801985
H  3.605148 -3.140188 -0.081931
H  -1.174249 4.235884 -0.600611
H  -2.797901 1.113381 1.834592
H  0.748306 -6.008962 0.913357
H  -2.463962 3.416009 -2.518105
H  -4.0796 0.277556 -0.082555
elementType: Cl O N C H
totalener: -1513.51966490 hartree
nucrepener: 2480.98239764 hartree
electener: -3994.50206254 hartree
oneelecener: -6998.51837783 hartree
twoeener: 3004.01631529 hartree
cpcmener: -0.02972308 hartree
kineticenergy: 1508.16135582 hartree
xcener: -124.307836678609 hartree
chargesum: 0.0000000
charge: -0.105074 -0.383182 -0.456328 -0.071641 -0.033715 -0.377919 0.356851 0.095292 0.140250 -0.256839 -0.295869 -0.349218 -0.348696 -0.165914 0.373841 -0.105489 0.060789 -0.157315 0.027919 -0.219192 -0.195105 -0.113414 -0.139579 -0.161217 0.107476 0.119070 -0.003558 0.113142 0.069769 0.107071 0.104031 0.110929 0.117337 0.115214 0.108002 0.109138 0.119776 0.114326 0.095612 0.087230 0.101065 0.087277 0.183938 0.179527 0.138186 0.146648 0.165513 0.142013 0.142033
qa: -0.1051 -0.3832 -0.4563 -0.0716 -0.0337 -0.3779 0.3569 0.0953 0.1403 -0.2568 -0.2959 -0.3492 -0.3487 -0.1659 0.3738 -0.1055 0.0608 -0.1573 0.0279 -0.2192 -0.1951 -0.1134 -0.1396 -0.1612 0.1075 0.1191 -0.0036 0.1131 0.0698 0.1071 0.1040 0.1109 0.1173 0.1152 0.1080 0.1091 0.1198 0.1143 0.0956 0.0872 0.1011 0.0873 0.1839 0.1795 0.1382 0.1466 0.1655 0.1420 0.1420
va: 1.2004 1.9810 2.0559 3.1785 3.2542 3.1037 4.0315 3.9783 3.9009 3.8576 3.9155 3.9435 3.9426 3.8526 4.2492 3.8768 3.5819 3.9198 4.0354 3.9318 3.8963 4.0154 3.9532 3.9617 3.7847 0.9942 1.0364 1.0380 1.0131 1.0107 1.0167 1.0014 1.0016 1.0055 1.0029 0.9973 1.0054 0.9968 1.0078 1.0303 1.0050 1.0080 0.9935 0.9869 1.0042 0.9998 1.0004 1.0048 1.0051
dispcorr: -0.031566606 hartree
energy: -1513.551231507534
dipole: 15.95161 -16.68735 -0.73574 5.28371 -3.35017 1.93354 7.51141 -7.96302 -0.45161
magnitude: 2.11751 au
magnitude: 5.38228 debye
