program: Orca
programVersion: 4.2.1
elementType: Cl O O N N N C C C C C C C C C C C C C C C C C C C H H H H H H H H H H H H H H H H H H H H H H H H
charge: 0
multiplicity: 1
keywords: wb97x-d3
keywords: def2-TZVPP
keywords: def2/J RIJCOSX GRIDX6 NOFINALGRIDX
keywords: grid4 nofinalgrid
keywords: scfconv7
keywords: smallprint printgap noloewdin
keywords: NOSOSCF
formula: C19H24ClN3O2
InChI: InChI=1S/C19H24ClN3O2/c1-18(2)13-25-19(3,23(18)17(24)22-12-11-21-14-22)10-4-5-15-6-8-16(20)9-7-15/h6-9,11-12,14H,4-5,10,13H2,1-3H3
49 atoms
Cl -4.889463 1.341986 -2.55003
O  1.881859 1.464462 -0.539359
O  2.025287 -1.342581 2.49582
N  1.87808 -0.615165 0.350464
N  1.782872 -2.902039 0.866017
N  2.286846 -5.033695 0.667044
C  1.829949 0.831807 0.717894
C  2.028859 -0.769523 -1.119498
C  2.57577 0.62321 -1.423227
C  0.485058 1.170886 1.356572
C  3.028704 1.269921 1.554185
C  3.032973 -1.82297 -1.562335
C  0.686297 -0.960281 -1.820906
C  0.242529 2.661549 1.564939
C  1.907469 -1.54827 1.306037
C  -1.213933 2.958698 1.941554
C  -2.175829 2.579352 0.84973
C  0.658773 -3.520342 0.376429
C  2.723203 -3.86653 1.042879
C  -2.234179 3.320997 -0.328847
C  -2.987203 1.45367 0.954034
C  0.99657 -4.833714 0.259125
C  -3.064583 2.952095 -1.375047
C  -3.825914 1.066071 -0.081951
C  -3.853872 1.819814 -1.242651
H  3.66153 0.663364 -1.262199
H  2.372973 0.937747 -2.447163
H  0.400993 0.656939 2.315782
H  -0.29486 0.758978 0.710767
H  3.966806 0.89777 1.1391
H  2.960819 0.935996 2.585562
H  3.080203 2.359178 1.559152
H  3.941374 -1.803726 -0.959477
H  3.322733 -1.606807 -2.592564
H  2.626256 -2.832599 -1.560282
H  0.829077 -0.918445 -2.901702
H  0.240937 -1.926919 -1.596212
H  -0.029669 -0.183528 -1.551158
H  0.888432 3.043062 2.359473
H  0.494573 3.222315 0.66165
H  -1.306892 4.025199 2.1609
H  -1.470955 2.428921 2.862417
H  -0.266833 -2.997644 0.208481
H  3.707391 -3.644113 1.425609
H  -1.61834 4.205848 -0.440411
H  -2.965826 0.857261 1.85841
H  0.374155 -5.643849 -0.087409
H  -3.093482 3.541462 -2.281823
H  -4.444909 0.184673 0.019796
elementType: Cl O N C H
totalener: -1513.52187823 hartree
nucrepener: 2426.08043514 hartree
electener: -3939.60231337 hartree
oneelecener: -6889.01321292 hartree
twoeener: 2949.41089955 hartree
cpcmener: -0.03103055 hartree
kineticenergy: 1508.15572687 hartree
xcener: -124.305438597656 hartree
chargesum: 0.0000000
charge: -0.106440 -0.372146 -0.458979 -0.069645 -0.030798 -0.371597 0.301897 0.125703 0.060389 -0.202635 -0.328039 -0.335159 -0.347582 -0.129200 0.361114 -0.091593 0.024550 -0.152334 0.037107 -0.213636 -0.186804 -0.128105 -0.153137 -0.144984 0.092775 0.084169 0.108681 0.105845 0.067959 0.104658 0.113630 0.106998 0.112202 0.120722 0.102696 0.110470 0.114933 0.106946 0.087568 0.084143 0.104323 0.086851 0.189463 0.175263 0.139343 0.141257 0.165384 0.142470 0.143305
qa: -0.1064 -0.3721 -0.4590 -0.0696 -0.0308 -0.3716 0.3019 0.1257 0.0604 -0.2026 -0.3280 -0.3352 -0.3476 -0.1292 0.3611 -0.0916 0.0246 -0.1523 0.0371 -0.2136 -0.1868 -0.1281 -0.1531 -0.1450 0.0928 0.0842 0.1087 0.1058 0.0680 0.1047 0.1136 0.1070 0.1122 0.1207 0.1027 0.1105 0.1149 0.1069 0.0876 0.0841 0.1043 0.0869 0.1895 0.1753 0.1393 0.1413 0.1654 0.1425 0.1433
va: 1.1990 1.9679 2.0527 3.1314 3.2534 3.1146 4.0541 3.9092 3.9407 3.8225 3.9505 3.9418 3.9545 3.8416 4.2655 3.8471 3.5836 3.9161 4.0392 3.9869 3.9142 4.0449 3.9833 3.9765 3.8267 1.0023 0.9917 1.0281 1.0267 1.0055 1.0191 1.0046 1.0016 1.0042 0.9962 1.0040 1.0024 1.0035 1.0116 1.0268 1.0036 1.0103 0.9807 0.9975 1.0035 1.0029 1.0031 1.0049 1.0040
dispcorr: -0.028960374 hartree
energy: -1513.550838599258
dipole: 22.95029 -22.42225 0.52804 4.77393 -2.88256 1.89137 5.21198 -6.21402 -1.00204
magnitude: 2.20459 au
magnitude: 5.60362 debye
