program: Orca
programVersion: 4.2.1
elementType: Cl O O N N N C C C C C C C C C C C C C C C C C C C H H H H H H H H H H H H H H H H H H H H H H H H
charge: 0
multiplicity: 1
keywords: wb97x-d3
keywords: def2-TZVPP
keywords: def2/J RIJCOSX GRIDX6 NOFINALGRIDX
keywords: grid4 nofinalgrid
keywords: scfconv7
keywords: smallprint printgap noloewdin
keywords: NOSOSCF
formula: C19H24ClN3O2
InChI: InChI=1S/C19H24ClN3O2/c1-18(2)13-25-19(3,23(18)17(24)22-12-11-21-14-22)10-4-5-15-6-8-16(20)9-7-15/h6-9,11-12,14H,4-5,10,13H2,1-3H3
49 atoms
Cl -4.454508 2.042677 -2.896112
O  2.189996 1.510526 0.512559
O  1.808419 -2.386358 -1.560574
N  2.207346 -0.638393 -0.172889
N  1.191703 -2.616803 0.607268
N  -0.278967 -3.896182 1.629063
C  1.853588 0.233985 0.998072
C  2.905333 0.156915 -1.213839
C  3.274048 1.372121 -0.371328
C  0.352593 0.235237 1.285324
C  2.691302 -0.075287 2.233629
C  4.15693 -0.518877 -1.750953
C  1.960008 0.56902 -2.341105
C  -0.116015 1.378662 2.178797
C  1.75893 -1.863466 -0.467795
C  -1.635419 1.351482 2.38211
C  -2.389544 1.524828 1.093434
C  1.837145 -3.156428 1.693342
C  -0.071547 -3.121025 0.605226
C  -3.005286 0.44901 0.460798
C  -2.437661 2.768158 0.465921
C  0.908766 -3.939331 2.307758
C  -3.643919 0.596646 -0.762753
C  -3.069984 2.937732 -0.755398
C  -3.667334 1.843946 -1.362951
H  4.221642 1.218131 0.162902
H  3.364559 2.28166 -0.966258
H  0.070815 -0.703074 1.764621
H  -0.175826 0.278422 0.329096
H  3.744547 -0.21888 1.989564
H  2.340727 -0.961692 2.757418
H  2.623443 0.758846 2.933332
H  3.934573 -1.322778 -2.448887
H  4.772766 -0.919415 -0.943825
H  4.756202 0.221518 -2.284967
H  1.095418 1.114286 -1.959231
H  2.485597 1.227671 -3.034869
H  1.601078 -0.285951 -2.909118
H  0.359629 1.314947 3.160522
H  0.168146 2.343115 1.753602
H  -1.906514 2.148541 3.078742
H  -1.926194 0.411775 2.858624
H  2.878108 -2.976599 1.900606
H  -0.790411 -2.859156 -0.155878
H  -2.987098 -0.530787 0.923579
H  -1.9722 3.627499 0.934438
H  1.037147 -4.533862 3.198582
H  -4.111466 -0.25518 -1.238136
H  -3.094927 3.912023 -1.224878
elementType: Cl O N C H
totalener: -1513.52082612 hartree
nucrepener: 2450.54130716 hartree
electener: -3964.06213328 hartree
oneelecener: -6938.12077073 hartree
twoeener: 2974.05863745 hartree
cpcmener: -0.03051434 hartree
kineticenergy: 1508.15125580 hartree
xcener: -124.303418387480 hartree
chargesum: -0.0000000
charge: -0.105821 -0.364216 -0.452758 -0.058930 -0.031475 -0.372572 0.237492 0.154023 0.065828 -0.199635 -0.337290 -0.321828 -0.356479 -0.141492 0.369769 -0.086958 0.024058 -0.157419 0.030677 -0.187374 -0.208521 -0.119012 -0.145632 -0.153435 0.093540 0.081847 0.108799 0.088338 0.105946 0.113136 0.120009 0.111526 0.108310 0.099008 0.112561 0.105128 0.106524 0.108929 0.086297 0.085093 0.103798 0.088891 0.193810 0.169049 0.136404 0.139899 0.166010 0.142928 0.143222
qa: -0.1058 -0.3642 -0.4528 -0.0589 -0.0315 -0.3726 0.2375 0.1540 0.0658 -0.1996 -0.3373 -0.3218 -0.3565 -0.1415 0.3698 -0.0870 0.0241 -0.1574 0.0307 -0.1874 -0.2085 -0.1190 -0.1456 -0.1534 0.0935 0.0818 0.1088 0.0883 0.1059 0.1131 0.1200 0.1115 0.1083 0.0990 0.1126 0.1051 0.1065 0.1089 0.0863 0.0851 0.1038 0.0889 0.1938 0.1690 0.1364 0.1399 0.1660 0.1429 0.1432
va: 1.1991 1.9660 2.0573 3.1239 3.2572 3.1059 4.0808 3.9113 3.9194 3.8469 3.9579 3.9065 3.9327 3.8856 4.2542 3.8247 3.5692 3.9114 4.0321 3.9220 3.9879 4.0390 3.9881 3.9819 3.8250 1.0020 0.9937 1.0116 1.0094 1.0045 0.9993 1.0078 1.0152 1.0055 0.9993 1.0061 1.0023 1.0180 1.0137 1.0280 1.0052 1.0119 0.9802 1.0022 1.0059 1.0030 1.0017 1.0047 1.0046
dispcorr: -0.029333236 hartree
energy: -1513.550159352635
dipole: 27.60144 -25.32963 2.27181 2.37394 -0.43115 1.94280 13.78881 -12.45399 1.33482
magnitude: 3.27373 au
magnitude: 8.32117 debye
