program: Orca
programVersion: 4.2.1
elementType: Cl O O N N N C C C C C C C C C C C C C C C C C C C H H H H H H H H H H H H H H H H H H H H H H H H
charge: 0
multiplicity: 1
keywords: wb97x-d3
keywords: def2-TZVPP
keywords: def2/J RIJCOSX GRIDX6 NOFINALGRIDX
keywords: grid4 nofinalgrid
keywords: scfconv7
keywords: smallprint printgap noloewdin
keywords: NOSOSCF
formula: C19H24ClN3O2
InChI: InChI=1S/C19H24ClN3O2/c1-18(2)13-25-19(3,23(18)17(24)22-12-11-21-14-22)10-4-5-15-6-8-16(20)9-7-15/h6-9,11-12,14H,4-5,10,13H2,1-3H3
49 atoms
Cl -5.030966 1.599302 -2.467068
O  1.944056 1.541416 -0.303136
O  1.899042 -1.627748 2.353259
N  1.944062 -0.632167 0.312891
N  1.888656 -2.967429 0.521403
N  1.064601 -4.787647 -0.399764
C  1.802889 0.753211 0.854267
C  2.306492 -0.591335 -1.128528
C  2.792046 0.856613 -1.187658
C  0.394614 0.977654 1.400204
C  2.903199 1.105596 1.85246
C  3.436562 -1.525572 -1.535064
C  1.092881 -0.765195 -2.036485
C  0.106483 2.41941 1.80264
C  1.916423 -1.679953 1.141546
C  -1.359283 2.635053 2.195785
C  -2.310266 2.388044 1.058332
C  2.81972 -3.956655 0.719795
C  0.843708 -3.5317 -0.14125
C  -3.065875 1.221775 0.983225
C  -2.423585 3.309377 0.018832
C  2.300019 -5.062121 0.12118
C  -3.904984 0.970013 -0.093368
C  -3.256018 3.078173 -1.064913
C  -3.990231 1.903022 -1.112659
H  3.845348 0.931401 -0.886877
H  2.693904 1.289982 -2.182852
H  0.233397 0.326494 2.26133
H  -0.311979 0.661161 0.627986
H  3.888904 0.810549 1.489313
H  2.74817 0.636282 2.81999
H  2.918472 2.18525 2.003463
H  4.252086 -1.521082 -0.810935
H  3.844416 -1.176074 -2.485653
H  3.113617 -2.552683 -1.692934
H  0.697375 -1.778238 -2.006951
H  0.286902 -0.078368 -1.776682
H  1.378109 -0.567275 -3.07077
H  0.729027 2.705286 2.653839
H  0.359965 3.101675 0.987368
H  -1.473447 3.661711 2.552128
H  -1.611535 1.98544 3.0377
H  3.751699 -3.779133 1.229863
H  -0.057749 -2.984147 -0.367047
H  -3.003418 0.487357 1.777492
H  -1.853421 4.230698 0.04986
H  2.749122 -6.03945 0.038221
H  -4.481373 0.055315 -0.131714
H  -3.330109 3.807777 -1.860275
elementType: Cl O N C H
totalener: -1513.52229255 hartree
nucrepener: 2411.80104445 hartree
electener: -3925.32333700 hartree
oneelecener: -6860.65825862 hartree
twoeener: 2935.33492162 hartree
cpcmener: -0.03091986 hartree
kineticenergy: 1508.15434891 hartree
xcener: -124.304558324740 hartree
chargesum: 0.0000000
charge: -0.106128 -0.369935 -0.457952 -0.061710 -0.032665 -0.373959 0.288047 0.112957 0.069080 -0.199361 -0.338143 -0.326792 -0.349320 -0.125704 0.365387 -0.092929 0.021211 -0.145768 0.025517 -0.189739 -0.210249 -0.117164 -0.141859 -0.152386 0.089518 0.083071 0.109160 0.103067 0.073081 0.104774 0.115677 0.108402 0.110455 0.119519 0.102220 0.112457 0.113775 0.109229 0.085919 0.085115 0.102957 0.089126 0.184134 0.176928 0.140021 0.141384 0.164228 0.143856 0.141490
qa: -0.1061 -0.3699 -0.4580 -0.0617 -0.0327 -0.3740 0.2880 0.1130 0.0691 -0.1994 -0.3381 -0.3268 -0.3493 -0.1257 0.3654 -0.0929 0.0212 -0.1458 0.0255 -0.1897 -0.2102 -0.1172 -0.1419 -0.1524 0.0895 0.0831 0.1092 0.1031 0.0731 0.1048 0.1157 0.1084 0.1105 0.1195 0.1022 0.1125 0.1138 0.1092 0.0859 0.0851 0.1030 0.0891 0.1841 0.1769 0.1400 0.1414 0.1642 0.1439 0.1415
va: 1.1991 1.9745 2.0531 3.1345 3.2579 3.1079 4.0750 3.9259 3.9248 3.8187 3.9511 3.9381 3.9519 3.8426 4.2572 3.8388 3.5724 3.9135 4.0481 3.9191 3.9850 4.0151 3.9771 3.9811 3.8279 1.0029 0.9917 1.0268 1.0281 1.0053 1.0185 1.0038 1.0022 1.0043 0.9953 1.0016 1.0031 1.0039 1.0125 1.0248 1.0040 1.0101 0.9938 0.9887 1.0033 1.0027 1.0009 1.0038 1.0051
dispcorr: -0.028520029 hartree
energy: -1513.550812575843
dipole: 26.75726 -24.90843 1.84883 3.90377 -2.08820 1.81558 7.22339 -7.55830 -0.33491
magnitude: 2.61279 au
magnitude: 6.64117 debye
