program: Orca
programVersion: 4.2.1
elementType: Cl O O N N N C C C C C C C C C C C C C C C C C C C H H H H H H H H H H H H H H H H H H H H H H H H
charge: 0
multiplicity: 1
keywords: wb97x-d3
keywords: def2-TZVPP
keywords: def2/J RIJCOSX GRIDX6 NOFINALGRIDX
keywords: grid4 nofinalgrid
keywords: scfconv7
keywords: smallprint printgap noloewdin
keywords: NOSOSCF
formula: C19H24ClN3O2
InChI: InChI=1S/C19H24ClN3O2/c1-18(2)13-25-19(3,23(18)17(24)22-12-11-21-14-22)10-4-5-15-6-8-16(20)9-7-15/h6-9,11-12,14H,4-5,10,13H2,1-3H3
49 atoms
Cl -4.271987 1.911282 -3.150695
O  2.139884 1.509162 0.299627
O  1.575888 -2.60355 -1.259442
N  2.101645 -0.708424 -0.127918
N  1.194822 -2.578535 0.97587
N  1.290124 -3.737152 2.844556
C  1.806906 0.302003 0.942564
C  2.693846 -0.041929 -1.311857
C  3.150423 1.246645 -0.64176
C  0.315742 0.356946 1.271054
C  2.68601 0.133037 2.175919
C  3.881515 -0.792216 -1.8944
C  1.640665 0.260658 -2.377309
C  -0.111836 1.578066 2.0771
C  1.634649 -1.958168 -0.234997
C  -1.633836 1.630168 2.25549
C  -2.354932 1.712597 0.939192
C  -0.05729 -3.112101 1.166314
C  1.970112 -3.009602 2.007937
C  -2.307776 2.880617 0.18073
C  -3.022573 0.613492 0.407578
C  0.019915 -3.799158 2.336781
C  -2.895579 2.952764 -1.071982
C  -3.618205 0.664396 -0.845075
C  -3.544362 1.836672 -1.577978
H  4.131205 1.122841 -0.164093
H  3.214506 2.083961 -1.336465
H  0.025857 -0.536562 1.825578
H  -0.232505 0.333803 0.3253
H  2.355541 -0.682032 2.815081
H  2.646307 1.043219 2.77461
H  3.728679 -0.043787 1.910374
H  4.440144 -0.119359 -2.547713
H  3.582754 -1.651329 -2.490464
H  4.561516 -1.131764 -1.112025
H  0.818103 0.852949 -1.973503
H  2.091958 0.833769 -3.188787
H  1.225906 -0.648192 -2.808158
H  0.348956 1.562317 3.06765
H  0.220353 2.496897 1.589808
H  -1.883293 2.497033 2.872213
H  -1.969685 0.748845 2.807707
H  -0.870888 -2.934203 0.483001
H  3.02266 -2.782385 2.07226
H  -1.799073 3.755459 0.568902
H  -3.075455 -0.308979 0.973941
H  -0.769944 -4.333264 2.841225
H  -2.845283 3.868526 -1.64577
H  -4.126541 -0.204112 -1.242052
elementType: Cl O N C H
totalener: -1513.52055032 hartree
nucrepener: 2455.17633453 hartree
electener: -3968.69688485 hartree
oneelecener: -6947.24538806 hartree
twoeener: 2978.54850321 hartree
cpcmener: -0.03047036 hartree
kineticenergy: 1508.16340111 hartree
xcener: -124.305594726083 hartree
chargesum: 0.0000000
charge: -0.105641 -0.368802 -0.450272 -0.068959 -0.033738 -0.377130 0.257681 0.161740 0.059277 -0.209509 -0.341557 -0.320650 -0.357906 -0.143452 0.369756 -0.086463 0.019734 -0.165562 0.029610 -0.208366 -0.180908 -0.106992 -0.152576 -0.146376 0.093298 0.082512 0.108156 0.097732 0.102179 0.122353 0.111975 0.112799 0.113126 0.107642 0.099189 0.101837 0.108448 0.109088 0.086838 0.086085 0.104413 0.087403 0.181831 0.182882 0.139335 0.135159 0.166044 0.143332 0.143406
qa: -0.1056 -0.3688 -0.4503 -0.0690 -0.0337 -0.3771 0.2577 0.1617 0.0593 -0.2095 -0.3416 -0.3207 -0.3579 -0.1435 0.3698 -0.0865 0.0197 -0.1656 0.0296 -0.2084 -0.1809 -0.1070 -0.1526 -0.1464 0.0933 0.0825 0.1082 0.0977 0.1022 0.1224 0.1120 0.1128 0.1131 0.1076 0.0992 0.1018 0.1084 0.1091 0.0868 0.0861 0.1044 0.0874 0.1818 0.1829 0.1393 0.1352 0.1660 0.1433 0.1434
va: 1.1996 1.9623 2.0594 3.1232 3.2600 3.1022 4.0728 3.9119 3.9353 3.8500 3.9627 3.9032 3.9357 3.8826 4.2543 3.8312 3.5826 3.9155 4.0278 3.9848 3.9165 4.0154 3.9823 3.9868 3.8265 1.0015 0.9940 1.0089 1.0095 0.9961 1.0076 1.0053 0.9993 1.0149 1.0065 1.0057 1.0028 1.0176 1.0129 1.0281 1.0052 1.0119 0.9953 0.9868 1.0034 1.0057 0.9998 1.0047 1.0043
dispcorr: -0.029495789 hartree
energy: -1513.550046106739
dipole: 23.82677 -22.76044 1.06633 2.88846 -0.85852 2.02994 11.96449 -11.48006 0.48442
magnitude: 2.34358 au
magnitude: 5.95692 debye
