program: Orca
programVersion: 4.2.1
elementType: Cl O O N N N C C C C C C C C C C C C C C C C C C C H H H H H H H H H H H H H H H H H H H H H H H H
charge: 0
multiplicity: 1
keywords: wb97x-d3
keywords: def2-TZVPP
keywords: def2/J RIJCOSX GRIDX6 NOFINALGRIDX
keywords: grid4 nofinalgrid
keywords: scfconv7
keywords: smallprint printgap noloewdin
keywords: NOSOSCF
formula: C19H24ClN3O2
InChI: InChI=1S/C19H24ClN3O2/c1-18(2)13-25-19(3,23(18)17(24)22-12-11-21-14-22)10-4-5-15-6-8-16(20)9-7-15/h6-9,11-12,14H,4-5,10,13H2,1-3H3
49 atoms
Cl -4.54457 1.900633 -2.845001
O  2.251564 1.522588 0.506166
O  1.83848 -2.36709 -1.574156
N  2.239603 -0.624865 -0.179671
N  1.152399 -2.574444 0.575391
N  -0.388635 -3.796248 1.562433
C  1.88936 0.252381 0.988168
C  2.981949 0.152954 -1.20283
C  3.349593 1.366841 -0.35678
C  0.386797 0.280305 1.266999
C  2.712914 -0.075452 2.229312
C  4.235944 -0.549294 -1.699043
C  2.077152 0.576932 -2.358463
C  -0.067434 1.445244 2.140302
C  1.771208 -1.839874 -0.484114
C  -1.581776 1.418553 2.377888
C  -2.367987 1.540346 1.102632
C  1.749043 -3.130047 1.680894
C  -0.127236 -3.03309 0.541967
C  -2.985938 0.436696 0.52222
C  -2.448467 2.761439 0.436029
C  0.777081 -3.874667 2.274998
C  -3.658169 0.535834 -0.688117
C  -3.115177 2.882712 -0.772856
C  -3.713918 1.762251 -1.328138
H  4.2845 1.20407 0.195655
H  3.462966 2.272658 -0.95252
H  0.0901 -0.645995 1.76046
H  -0.138219 0.316615 0.308676
H  2.667115 0.761697 2.926517
H  3.762064 -0.252076 1.990741
H  2.334163 -0.949309 2.753443
H  4.821811 -0.950603 -0.870793
H  4.862642 0.17378 -2.224805
H  4.018652 -1.358023 -2.392875
H  1.213375 1.141103 -2.003494
H  2.6347 1.221427 -3.040262
H  1.717315 -0.273986 -2.932272
H  0.428232 1.409081 3.113536
H  0.205347 2.398689 1.683819
H  -1.841368 2.238921 3.051425
H  -1.854948 0.495197 2.895001
H  2.789519 -2.986288 1.915849
H  -0.815984 -2.750644 -0.239445
H  -2.943751 -0.526564 1.017027
H  -1.982558 3.641615 0.863766
H  0.86065 -4.468666 3.171594
H  -4.127471 -0.336802 -1.122225
H  -3.165694 3.840728 -1.272823
elementType: Cl O N C H
totalener: -1513.52095345 hartree
nucrepener: 2451.10526167 hartree
electener: -3964.62621511 hartree
oneelecener: -6939.25865757 hartree
twoeener: 2974.63244246 hartree
cpcmener: -0.03054814 hartree
kineticenergy: 1508.15534225 hartree
xcener: -124.304343072454 hartree
chargesum: 0.0000000
charge: -0.105853 -0.363014 -0.453898 -0.054340 -0.029878 -0.372766 0.228955 0.149411 0.070064 -0.191160 -0.336438 -0.322434 -0.355787 -0.143131 0.368752 -0.087255 0.026600 -0.156950 0.033174 -0.188703 -0.208593 -0.120353 -0.146055 -0.151476 0.092485 0.081292 0.108455 0.084932 0.105106 0.111648 0.113243 0.120139 0.098915 0.112720 0.108408 0.105790 0.105775 0.108787 0.086862 0.084345 0.103264 0.089230 0.193540 0.168060 0.135874 0.140216 0.165878 0.142858 0.143303
qa: -0.1059 -0.3630 -0.4539 -0.0543 -0.0299 -0.3728 0.2290 0.1494 0.0701 -0.1912 -0.3364 -0.3224 -0.3558 -0.1431 0.3688 -0.0873 0.0266 -0.1569 0.0332 -0.1887 -0.2086 -0.1204 -0.1461 -0.1515 0.0925 0.0813 0.1085 0.0849 0.1051 0.1116 0.1132 0.1201 0.0989 0.1127 0.1084 0.1058 0.1058 0.1088 0.0869 0.0843 0.1033 0.0892 0.1935 0.1681 0.1359 0.1402 0.1659 0.1429 0.1433
va: 1.1993 1.9671 2.0561 3.1250 3.2562 3.1027 4.0862 3.9158 3.9141 3.8426 3.9575 3.9080 3.9310 3.8902 4.2541 3.8223 3.5678 3.9101 4.0276 3.9240 3.9882 4.0393 3.9899 3.9799 3.8260 1.0020 0.9937 1.0109 1.0093 1.0081 1.0042 0.9994 1.0052 0.9993 1.0154 1.0062 1.0022 1.0183 1.0140 1.0276 1.0055 1.0116 0.9805 1.0029 1.0073 1.0030 1.0019 1.0048 1.0046
dispcorr: -0.029388770 hartree
energy: -1513.550342216402
dipole: 28.47464 -26.11730 2.35734 2.87260 -0.93603 1.93656 13.73782 -12.36649 1.37132
magnitude: 3.34482 au
magnitude: 8.50186 debye
