program: Orca
programVersion: 4.2.1
elementType: Cl O O N N N C C C C C C C C C C C C C C C C C C C H H H H H H H H H H H H H H H H H H H H H H H H
charge: 0
multiplicity: 1
keywords: wb97x-d3
keywords: def2-TZVPP
keywords: def2/J RIJCOSX GRIDX6 NOFINALGRIDX
keywords: grid4 nofinalgrid
keywords: scfconv7
keywords: smallprint printgap noloewdin
keywords: NOSOSCF
formula: C19H24ClN3O2
InChI: InChI=1S/C19H24ClN3O2/c1-18(2)13-25-19(3,23(18)17(24)22-12-11-21-14-22)10-4-5-15-6-8-16(20)9-7-15/h6-9,11-12,14H,4-5,10,13H2,1-3H3
49 atoms
Cl -4.510514 2.036181 -3.061346
O  2.164707 1.494402 0.297351
O  1.649239 -2.613602 -1.287357
N  2.148066 -0.721025 -0.136775
N  1.250367 -2.605918 0.944796
N  1.353656 -3.744252 2.825752
C  1.810249 0.285074 0.923784
C  2.791584 -0.053934 -1.293061
C  3.21047 1.240128 -0.606579
C  0.306983 0.338043 1.194255
C  2.639399 0.113575 2.193249
C  4.010119 -0.801977 -1.810103
C  1.793793 0.242942 -2.411584
C  -0.13655 1.538495 2.022247
C  1.692068 -1.974076 -0.258513
C  -1.655762 1.566384 2.222032
C  -2.408918 1.685909 0.926765
C  0.017458 -3.189888 1.113747
C  2.020588 -2.996375 1.997064
C  -2.439446 2.895534 0.23561
C  -3.04936 0.590036 0.356138
C  0.098065 -3.8626 2.292052
C  -3.082055 3.013428 -0.986507
C  -3.698313 0.686128 -0.866868
C  -3.706543 1.901308 -1.530233
H  4.175338 1.128348 -0.094616
H  3.289093 2.07701 -1.300552
H  -0.005387 -0.570243 1.711897
H  -0.207111 0.345171 0.229126
H  3.674406 -0.145165 1.971243
H  2.233648 -0.6473 2.855352
H  2.645185 1.050221 2.750021
H  4.671133 -1.097519 -0.994264
H  4.57629 -0.143487 -2.4711
H  3.747619 -1.689178 -2.381646
H  0.965694 0.858471 -2.057302
H  2.293256 0.790613 -3.212183
H  1.382202 -0.666831 -2.842897
H  0.333398 1.513993 3.008344
H  0.178793 2.469568 1.546748
H  -1.903973 2.409383 2.871395
H  -1.971387 0.664058 2.751852
H  -0.787898 -3.053207 0.411546
H  3.060948 -2.724656 2.081143
H  -1.953929 3.76888 0.655489
H  -3.044346 -0.363922 0.870187
H  -0.679673 -4.424572 2.78485
H  -3.095526 3.962279 -1.505979
H  -4.187544 -0.179512 -1.293037
elementType: Cl O N C H
totalener: -1513.52114217 hartree
nucrepener: 2441.68240838 hartree
electener: -3955.20355054 hartree
oneelecener: -6920.23875609 hartree
twoeener: 2965.03520554 hartree
cpcmener: -0.03056895 hartree
kineticenergy: 1508.16295596 hartree
xcener: -124.305245265394 hartree
chargesum: -0.0000000
charge: -0.105782 -0.366677 -0.450778 -0.067148 -0.035439 -0.376537 0.256836 0.154511 0.062755 -0.209995 -0.353692 -0.318227 -0.355727 -0.137347 0.373501 -0.087133 0.020847 -0.167710 0.030849 -0.209153 -0.183511 -0.105809 -0.152192 -0.146617 0.092728 0.080862 0.108209 0.094270 0.103840 0.114727 0.124372 0.114314 0.098515 0.111761 0.108309 0.104347 0.107186 0.108467 0.086977 0.085100 0.103392 0.088810 0.183414 0.182673 0.140614 0.134757 0.166028 0.143384 0.143118
qa: -0.1058 -0.3667 -0.4508 -0.0671 -0.0354 -0.3765 0.2568 0.1545 0.0628 -0.2100 -0.3537 -0.3182 -0.3557 -0.1373 0.3735 -0.0871 0.0208 -0.1677 0.0308 -0.2092 -0.1835 -0.1058 -0.1522 -0.1466 0.0927 0.0809 0.1082 0.0943 0.1038 0.1147 0.1244 0.1143 0.0985 0.1118 0.1083 0.1043 0.1072 0.1085 0.0870 0.0851 0.1034 0.0888 0.1834 0.1827 0.1406 0.1348 0.1660 0.1434 0.1431
va: 1.1994 1.9645 2.0582 3.1150 3.2627 3.1016 4.0708 3.9231 3.9345 3.8567 3.9570 3.9056 3.9319 3.8783 4.2509 3.8261 3.5725 3.9162 4.0275 3.9863 3.9213 4.0140 3.9817 3.9889 3.8269 1.0013 0.9934 1.0086 1.0090 1.0050 0.9941 1.0086 1.0065 0.9998 1.0148 1.0062 1.0024 1.0187 1.0123 1.0275 1.0054 1.0115 0.9951 0.9870 1.0029 1.0058 0.9996 1.0046 1.0045
dispcorr: -0.029158321 hartree
energy: -1513.550300486135
dipole: 24.92712 -23.83106 1.09607 2.25740 -0.28539 1.97201 11.73509 -11.23887 0.49622
magnitude: 2.31007 au
magnitude: 5.87173 debye
