program: Orca
programVersion: 4.2.1
elementType: Cl O O N N N C C C C C C C C C C C C C C C C C C C H H H H H H H H H H H H H H H H H H H H H H H H
charge: 0
multiplicity: 1
keywords: wb97x-d3
keywords: def2-TZVPP
keywords: def2/J RIJCOSX GRIDX6 NOFINALGRIDX
keywords: grid4 nofinalgrid
keywords: scfconv7
keywords: smallprint printgap noloewdin
keywords: NOSOSCF
formula: C19H24ClN3O2
InChI: InChI=1S/C19H24ClN3O2/c1-18(2)13-25-19(3,23(18)17(24)22-12-11-21-14-22)10-4-5-15-6-8-16(20)9-7-15/h6-9,11-12,14H,4-5,10,13H2,1-3H3
49 atoms
Cl -4.634267 1.805911 -2.792162
O  2.30354 1.525249 0.511532
O  1.770743 -2.325115 -1.599582
N  2.248114 -0.617856 -0.183099
N  1.113221 -2.545016 0.556215
N  -0.436781 -3.757494 1.54032
C  1.908372 0.261976 0.984959
C  3.014178 0.147105 -1.197357
C  3.405272 1.347967 -0.342792
C  0.40384 0.321262 1.249148
C  2.711928 -0.086928 2.235709
C  4.251446 -0.588265 -1.687416
C  2.129325 0.602415 -2.357199
C  -0.033948 1.501104 2.11016
C  1.737121 -1.813486 -0.50061
C  -1.54436 1.482727 2.369568
C  -2.352807 1.565066 1.104965
C  1.700303 -3.092733 1.671157
C  -0.167477 -3.002172 0.516793
C  -2.984334 0.444042 0.574562
C  -2.44728 2.764502 0.401832
C  0.723091 -3.831423 2.263133
C  -3.688075 0.506563 -0.620256
C  -3.145185 2.848859 -0.792667
C  -3.760552 1.71286 -1.29602
H  4.331112 1.161933 0.21667
H  3.543805 2.253508 -0.933096
H  0.085474 -0.596485 1.745468
H  -0.113082 0.36196 0.286551
H  3.746889 -0.336177 2.002884
H  2.27942 -0.92085 2.781885
H  2.720163 0.768242 2.911109
H  4.012204 -1.408525 -2.360385
H  4.834818 -0.982545 -0.85471
H  4.887658 0.109353 -2.235085
H  1.739936 -0.235103 -2.931273
H  1.28587 1.198498 -2.005942
H  2.712646 1.224761 -3.037613
H  0.474868 1.479338 3.077104
H  0.237253 2.445196 1.633723
H  -1.794511 2.322204 3.022794
H  -1.808645 0.574782 2.91761
H  2.739295 -2.950849 1.912802
H  -0.851126 -2.72587 -0.270967
H  -2.929087 -0.503294 1.098207
H  -1.969499 3.656661 0.789889
H  0.798787 -4.41965 3.164252
H  -4.170259 -0.377879 -1.014647
H  -3.208262 3.790622 -1.321397
elementType: Cl O N C H
totalener: -1513.52094734 hartree
nucrepener: 2451.47769187 hartree
electener: -3964.99863921 hartree
oneelecener: -6940.02892170 hartree
twoeener: 2975.03028249 hartree
cpcmener: -0.03030997 hartree
kineticenergy: 1508.16019904 hartree
xcener: -124.305390137310 hartree
chargesum: -0.0000000
charge: -0.105874 -0.360971 -0.453544 -0.057645 -0.029227 -0.372674 0.230242 0.147800 0.070448 -0.191660 -0.339924 -0.320389 -0.355539 -0.141611 0.368118 -0.088952 0.025964 -0.157503 0.034713 -0.186218 -0.207880 -0.119697 -0.148240 -0.150627 0.092931 0.080561 0.108411 0.084332 0.104923 0.113427 0.121118 0.113281 0.108685 0.098277 0.111899 0.108867 0.105443 0.105417 0.087796 0.083067 0.103040 0.089472 0.194417 0.167579 0.135474 0.140368 0.165946 0.143234 0.142924
qa: -0.1059 -0.3610 -0.4535 -0.0576 -0.0292 -0.3727 0.2302 0.1478 0.0704 -0.1917 -0.3399 -0.3204 -0.3555 -0.1416 0.3681 -0.0890 0.0260 -0.1575 0.0347 -0.1862 -0.2079 -0.1197 -0.1482 -0.1506 0.0929 0.0806 0.1084 0.0843 0.1049 0.1134 0.1211 0.1133 0.1087 0.0983 0.1119 0.1089 0.1054 0.1054 0.0878 0.0831 0.1030 0.0895 0.1944 0.1676 0.1355 0.1404 0.1659 0.1432 0.1429
va: 1.1992 1.9671 2.0558 3.1194 3.2562 3.1018 4.0783 3.9241 3.9157 3.8423 3.9525 3.9083 3.9288 3.8905 4.2535 3.8219 3.5698 3.9113 4.0263 3.9252 3.9851 4.0404 3.9928 3.9791 3.8243 1.0019 0.9938 1.0103 1.0081 1.0043 0.9983 1.0088 1.0151 1.0057 0.9997 1.0191 1.0065 1.0022 1.0139 1.0276 1.0058 1.0111 0.9800 1.0037 1.0079 1.0029 1.0020 1.0048 1.0047
dispcorr: -0.029417317 hartree
energy: -1513.550364654483
dipole: 29.12921 -26.69872 2.43050 3.20651 -1.29376 1.91276 13.60021 -12.21374 1.38647
magnitude: 3.38943 au
magnitude: 8.61525 debye
