program: Orca
programVersion: 4.2.1
elementType: Cl O O N N N C C C C C C C C C C C C C C C C C C C H H H H H H H H H H H H H H H H H H H H H H H H
charge: 0
multiplicity: 1
keywords: wb97x-d3
keywords: def2-TZVPP
keywords: def2/J RIJCOSX GRIDX6 NOFINALGRIDX
keywords: grid4 nofinalgrid
keywords: scfconv7
keywords: smallprint printgap noloewdin
keywords: NOSOSCF
formula: C19H24ClN3O2
InChI: InChI=1S/C19H24ClN3O2/c1-18(2)13-25-19(3,23(18)17(24)22-12-11-21-14-22)10-4-5-15-6-8-16(20)9-7-15/h6-9,11-12,14H,4-5,10,13H2,1-3H3
49 atoms
Cl -4.823149 1.437863 -2.496718
O  1.926951 1.572156 -0.301003
O  1.966177 -1.597922 2.359369
N  1.906326 -0.601386 0.320049
N  1.786849 -2.93277 0.532559
N  0.825556 -4.723182 -0.311233
C  1.825937 0.787389 0.864086
C  2.140025 -0.568224 -1.146715
C  2.684866 0.85486 -1.240267
C  0.449715 1.037224 1.477348
C  2.980574 1.123262 1.803334
C  3.180283 -1.552925 -1.658058
C  0.841414 -0.678301 -1.941434
C  0.180155 2.49282 1.841161
C  1.900992 -1.648563 1.148997
C  -1.289165 2.737664 2.205163
C  -2.219097 2.436859 1.062984
C  2.696696 -3.953286 0.65354
C  0.669971 -3.461062 -0.036286
C  -2.991236 1.279184 1.042426
C  -2.282954 3.285889 -0.040163
C  2.090622 -5.040323 0.104372
C  -3.79601 0.963793 -0.043432
C  -3.080476 2.990347 -1.134417
C  -3.829728 1.823757 -1.127837
H  3.7573 0.880775 -1.007091
H  2.541703 1.296012 -2.226343
H  0.330685 0.41488 2.366293
H  -0.294736 0.696193 0.753233
H  3.002128 2.200596 1.970107
H  3.943554 0.835837 1.377987
H  2.882711 0.639193 2.770915
H  2.79152 -2.560501 -1.791408
H  4.056157 -1.597115 -1.009886
H  3.518698 -1.215787 -2.639803
H  1.03774 -0.481926 -2.99647
H  0.405451 -1.673547 -1.88075
H  0.092685 0.039348 -1.605053
H  0.797979 2.792755 2.69095
H  0.450074 3.15034 1.011334
H  -1.401095 3.781614 2.508175
H  -1.560373 2.132016 3.073486
H  3.674857 -3.807892 1.080644
H  -0.228844 -2.883794 -0.185845
H  -2.96498 0.600436 1.886728
H  -1.698281 4.19852 -0.053517
H  2.496528 -6.032614 -0.015102
H  -4.383919 0.055619 -0.03993
H  -3.114759 3.662371 -1.981574
elementType: Cl O N C H
totalener: -1513.52180960 hartree
nucrepener: 2428.45560454 hartree
electener: -3941.97741413 hartree
oneelecener: -6893.95522725 hartree
twoeener: 2951.97781311 hartree
cpcmener: -0.03086945 hartree
kineticenergy: 1508.15996334 hartree
xcener: -124.306031595190 hartree
chargesum: 0.0000000
charge: -0.106206 -0.372342 -0.459959 -0.065686 -0.032790 -0.373347 0.295193 0.120912 0.062443 -0.195894 -0.328852 -0.328997 -0.350376 -0.132333 0.364075 -0.093296 0.023249 -0.143534 0.025898 -0.185572 -0.210184 -0.118600 -0.145923 -0.152508 0.092991 0.084048 0.109001 0.105813 0.067190 0.107611 0.104680 0.112999 0.102649 0.111647 0.119438 0.110920 0.114490 0.108290 0.086558 0.085397 0.103395 0.087837 0.184793 0.175383 0.140688 0.139589 0.164318 0.143129 0.141770
qa: -0.1062 -0.3723 -0.4600 -0.0657 -0.0328 -0.3733 0.2952 0.1209 0.0624 -0.1959 -0.3289 -0.3290 -0.3504 -0.1323 0.3641 -0.0933 0.0232 -0.1435 0.0259 -0.1856 -0.2102 -0.1186 -0.1459 -0.1525 0.0930 0.0840 0.1090 0.1058 0.0672 0.1076 0.1047 0.1130 0.1026 0.1116 0.1194 0.1109 0.1145 0.1083 0.0866 0.0854 0.1034 0.0878 0.1848 0.1754 0.1407 0.1396 0.1643 0.1431 0.1418
va: 1.1989 1.9675 2.0510 3.1342 3.2579 3.1082 4.0605 3.9204 3.9365 3.8203 3.9522 3.9355 3.9566 3.8453 4.2563 3.8465 3.5796 3.9122 4.0495 3.9138 3.9843 4.0143 3.9779 3.9819 3.8244 1.0029 0.9923 1.0276 1.0277 1.0041 1.0054 1.0200 0.9951 1.0024 1.0046 1.0044 1.0009 1.0023 1.0123 1.0262 1.0042 1.0099 0.9932 0.9899 1.0029 1.0033 1.0008 1.0040 1.0050
dispcorr: -0.028943902 hartree
energy: -1513.550753500179
dipole: 25.40122 -23.63137 1.76985 4.64487 -2.82514 1.81973 7.06483 -7.50252 -0.43769
magnitude: 2.57592 au
magnitude: 6.54748 debye
