program: Orca
programVersion: 4.2.1
elementType: Cl O O N N N C C C C C C C C C C C C C C C C C C C H H H H H H H H H H H H H H H H H H H H H H H H
charge: 0
multiplicity: 1
keywords: wb97x-d3
keywords: def2-TZVPP
keywords: def2/J RIJCOSX GRIDX6 NOFINALGRIDX
keywords: grid4 nofinalgrid
keywords: scfconv7
keywords: smallprint printgap noloewdin
keywords: NOSOSCF
formula: C19H24ClN3O2
InChI: InChI=1S/C19H24ClN3O2/c1-18(2)13-25-19(3,23(18)17(24)22-12-11-21-14-22)10-4-5-15-6-8-16(20)9-7-15/h6-9,11-12,14H,4-5,10,13H2,1-3H3
49 atoms
Cl -5.645654 4.02271 1.326365
O  1.114891 1.110954 0.579915
O  1.177817 -2.95088 1.283602
N  1.784331 -1.016497 0.260717
N  2.687177 -3.084344 -0.398849
N  4.242019 -4.546517 -0.931154
C  0.81578 -0.183845 1.036251
C  2.788847 -0.151359 -0.418771
C  2.493662 1.157025 0.319875
C  -0.642682 -0.503226 0.71492
C  1.059171 -0.262944 2.543883
C  4.237322 -0.55716 -0.1852
C  2.513102 0.031885 -1.907847
C  -1.064586 -0.495567 -0.751556
C  1.819367 -2.339538 0.454524
C  -1.294612 0.873303 -1.406116
C  -2.37229 1.675916 -0.733421
C  2.593987 -3.27118 -1.755526
C  3.681437 -3.897837 0.047267
C  -3.71566 1.436893 -1.01702
C  -2.068015 2.656626 0.207376
C  3.564784 -4.175066 -2.060003
C  -4.726831 2.149543 -0.390877
C  -3.064838 3.381846 0.845084
C  -4.390007 3.120643 0.539006
H  3.082144 1.230323 1.243672
H  2.712347 2.034581 -0.288416
H  -1.256395 0.197351 1.289078
H  -0.865922 -1.484355 1.134459
H  0.49303 0.532635 3.030291
H  2.111061 -0.13153 2.801167
H  0.729994 -1.208244 2.965795
H  4.424854 -0.829219 0.854175
H  4.876047 0.297752 -0.416563
H  4.564996 -1.37205 -0.828506
H  1.486693 0.342239 -2.101052
H  3.171644 0.807677 -2.301167
H  2.711112 -0.869054 -2.483267
H  -0.344325 -1.05624 -1.354004
H  -1.997882 -1.060697 -0.82308
H  -1.576699 0.699275 -2.447636
H  -0.371196 1.450356 -1.42946
H  1.834623 -2.805284 -2.358701
H  3.958637 -3.945467 1.08911
H  -3.985834 0.683533 -1.748016
H  -1.033776 2.863159 0.453466
H  3.800594 -4.584762 -3.029789
H  -5.762545 1.950456 -0.631696
H  -2.804745 4.1418 1.569817
elementType: Cl O N C H
totalener: -1513.51936906 hartree
nucrepener: 2409.57283017 hartree
electener: -3923.09219923 hartree
oneelecener: -6855.72043572 hartree
twoeener: 2932.62823649 hartree
cpcmener: -0.03000871 hartree
kineticenergy: 1508.15492200 hartree
xcener: -124.307337744613 hartree
chargesum: 0.0000000
charge: -0.106382 -0.362829 -0.455795 -0.054123 -0.023763 -0.371243 0.251406 0.105258 0.074794 -0.185231 -0.320688 -0.334541 -0.360336 -0.186885 0.353177 -0.062912 0.038641 -0.153302 0.039094 -0.215845 -0.243941 -0.126195 -0.149757 -0.128824 0.084302 0.086585 0.105616 0.110603 0.121542 0.108734 0.100979 0.109181 0.112519 0.120762 0.101491 0.118347 0.111818 0.118465 0.084920 0.103733 0.100428 0.085510 0.187565 0.173481 0.139831 0.143259 0.166971 0.142138 0.141444
qa: -0.1064 -0.3628 -0.4558 -0.0541 -0.0238 -0.3712 0.2514 0.1053 0.0748 -0.1852 -0.3207 -0.3345 -0.3603 -0.1869 0.3532 -0.0629 0.0386 -0.1533 0.0391 -0.2158 -0.2439 -0.1262 -0.1498 -0.1288 0.0843 0.0866 0.1056 0.1106 0.1215 0.1087 0.1010 0.1092 0.1125 0.1208 0.1015 0.1183 0.1118 0.1185 0.0849 0.1037 0.1004 0.0855 0.1876 0.1735 0.1398 0.1433 0.1670 0.1421 0.1414
va: 1.1991 1.9532 2.0581 3.1285 3.2490 3.1176 4.0688 3.9187 3.8856 3.7404 3.9358 3.9534 3.9408 3.9395 4.2684 3.7707 3.5798 3.9224 4.0399 4.0009 3.9291 4.0529 3.9804 3.9848 3.8278 1.0027 0.9947 1.0059 1.0236 1.0092 1.0036 1.0209 1.0004 1.0036 0.9969 0.9964 1.0054 1.0024 1.0137 1.0073 1.0045 1.0239 0.9805 0.9992 1.0039 1.0239 1.0028 1.0050 1.0058
dispcorr: -0.030409201 hartree
energy: -1513.549778256982
dipole: 26.06427 -25.14950 0.91477 -7.32321 9.03263 1.70943 -7.73410 6.75864 -0.97545
magnitude: 2.17036 au
magnitude: 5.51661 debye
