program: Orca
programVersion: 4.2.1
elementType: Cl O O N N N C C C C C C C C C C C C C C C C C C C H H H H H H H H H H H H H H H H H H H H H H H H
charge: 0
multiplicity: 1
keywords: wb97x-d3
keywords: def2-TZVPP
keywords: def2/J RIJCOSX GRIDX6 NOFINALGRIDX
keywords: grid4 nofinalgrid
keywords: scfconv7
keywords: smallprint printgap noloewdin
keywords: NOSOSCF
formula: C19H24ClN3O2
InChI: InChI=1S/C19H24ClN3O2/c1-18(2)13-25-19(3,23(18)17(24)22-12-11-21-14-22)10-4-5-15-6-8-16(20)9-7-15/h6-9,11-12,14H,4-5,10,13H2,1-3H3
49 atoms
Cl -5.508954 4.241424 1.169014
O  1.175413 1.205483 0.224156
O  1.31451 -2.675461 1.625474
N  1.833502 -0.947476 0.247832
N  2.624339 -3.119047 -0.172819
N  4.070227 -4.706576 -0.651509
C  0.954567 0.027783 0.957612
C  2.746263 -0.244819 -0.693723
C  2.509052 1.190725 -0.213668
C  -0.528781 -0.328639 0.881732
C  1.384238 0.232675 2.409665
C  4.217321 -0.600461 -0.528281
C  2.317816 -0.377991 -2.151278
C  -1.116066 -0.614139 -0.497829
C  1.871887 -2.222005 0.648196
C  -1.44225 0.598519 -1.380356
C  -2.450262 1.523344 -0.759412
C  2.273153 -3.602398 -1.410027
C  3.697586 -3.840269 0.24536
C  -2.057952 2.663027 -0.0614
C  -3.812963 1.243873 -0.841073
C  3.182411 -4.577037 -1.684303
C  -2.988319 3.502283 0.535214
C  -4.758858 2.069433 -0.252819
C  -4.335305 3.196729 0.433289
H  3.206487 1.458999 0.590738
H  2.627433 1.918449 -1.016576
H  -1.075604 0.487023 1.363944
H  -0.697521 -1.196265 1.518937
H  2.448139 0.458225 2.495548
H  1.180014 -0.639574 3.02461
H  0.828689 1.07301 2.828347
H  4.506628 -0.659777 0.521703
H  4.817913 0.187258 -0.98765
H  4.492474 -1.529977 -1.023068
H  1.272984 -0.104971 -2.298527
H  2.924081 0.28931 -2.765862
H  2.467662 -1.383578 -2.536828
H  -0.458565 -1.285615 -1.05732
H  -2.040574 -1.178518 -0.348329
H  -1.836763 0.22272 -2.327925
H  -0.536448 1.153152 -1.6217
H  1.408374 -3.252751 -1.947227
H  4.167746 -3.664471 1.200691
H  -1.005816 2.904983 0.024108
H  -4.151063 0.366837 -1.380681
H  3.238473 -5.193897 -2.567597
H  -2.66085 4.383496 1.070547
H  -5.811904 1.835678 -0.334408
elementType: Cl O N C H
totalener: -1513.51921920 hartree
nucrepener: 2410.67695877 hartree
electener: -3924.19617797 hartree
oneelecener: -6857.92822036 hartree
twoeener: 2933.73204238 hartree
cpcmener: -0.03014409 hartree
kineticenergy: 1508.15647311 hartree
xcener: -124.306949074278 hartree
chargesum: -0.0000000
charge: -0.106461 -0.363108 -0.451586 -0.040047 -0.022092 -0.371875 0.238417 0.115343 0.074316 -0.180417 -0.314698 -0.344355 -0.366213 -0.184092 0.342106 -0.063581 0.044010 -0.152636 0.032798 -0.249433 -0.218787 -0.125035 -0.128421 -0.148768 0.083930 0.086286 0.105414 0.110304 0.120874 0.100408 0.108921 0.108038 0.112408 0.121318 0.103322 0.118610 0.112668 0.121655 0.081349 0.104183 0.100626 0.085187 0.189268 0.173865 0.144001 0.140377 0.166532 0.142758 0.142317
qa: -0.1065 -0.3631 -0.4516 -0.0400 -0.0221 -0.3719 0.2384 0.1153 0.0743 -0.1804 -0.3147 -0.3444 -0.3662 -0.1841 0.3421 -0.0636 0.0440 -0.1526 0.0328 -0.2494 -0.2188 -0.1250 -0.1284 -0.1488 0.0839 0.0863 0.1054 0.1103 0.1209 0.1004 0.1089 0.1080 0.1124 0.1213 0.1033 0.1186 0.1127 0.1217 0.0813 0.1042 0.1006 0.0852 0.1893 0.1739 0.1440 0.1404 0.1665 0.1428 0.1423
va: 1.1988 1.9534 2.0601 3.1243 3.2468 3.1155 4.0807 3.9065 3.8799 3.7318 3.9402 3.9561 3.9392 3.9446 4.2752 3.7692 3.5718 3.9144 4.0426 3.9301 4.0026 4.0516 3.9849 3.9790 3.8297 1.0024 0.9943 1.0072 1.0256 1.0038 1.0210 1.0081 1.0003 1.0029 0.9969 0.9969 1.0050 1.0014 1.0161 1.0078 1.0046 1.0236 0.9798 0.9987 1.0241 1.0041 1.0027 1.0055 1.0049
dispcorr: -0.030482341 hartree
energy: -1513.549701542764
dipole: 25.39503 -24.56601 0.82902 -8.82847 10.37424 1.54576 -8.82246 7.53520 -1.28726
magnitude: 2.17571 au
magnitude: 5.53021 debye
