program: Orca
programVersion: 4.2.1
elementType: Cl O O N N N C C C C C C C C C C C C C C C C C C C H H H H H H H H H H H H H H H H H H H H H H H H
charge: 0
multiplicity: 1
keywords: wb97x-d3
keywords: def2-TZVPP
keywords: def2/J RIJCOSX GRIDX6 NOFINALGRIDX
keywords: grid4 nofinalgrid
keywords: scfconv7
keywords: smallprint printgap noloewdin
keywords: NOSOSCF
formula: C19H24ClN3O2
InChI: InChI=1S/C19H24ClN3O2/c1-18(2)13-25-19(3,23(18)17(24)22-12-11-21-14-22)10-4-5-15-6-8-16(20)9-7-15/h6-9,11-12,14H,4-5,10,13H2,1-3H3
49 atoms
Cl -5.344537 -0.843934 1.037941
O  2.997238 1.621479 0.543598
O  2.654867 -2.150954 -1.715081
N  2.61365 -0.467402 -0.199363
N  0.668748 -1.69533 -0.739575
N  -1.398233 -2.123399 -1.365871
C  1.957261 0.676249 0.517025
C  4.081202 -0.248955 -0.267182
C  4.201455 0.915967 0.71224
C  0.796754 1.288181 -0.261722
C  1.561885 0.308094 1.95008
C  4.883956 -1.445665 0.21838
C  4.530985 0.206201 -1.655296
C  0.333269 2.632678 0.292606
C  2.061477 -1.451587 -0.919748
C  -0.990568 3.08445 -0.334767
C  -2.121342 2.14571 -0.017279
C  -0.013834 -2.06277 0.396219
C  -0.214881 -1.773657 -1.772929
C  -2.626235 1.269635 -0.972087
C  -2.64901 2.08539 1.271721
C  -1.285495 -2.314339 -0.015832
C  -3.618133 0.35081 -0.660684
C  -3.642297 1.178184 1.60308
C  -4.115843 0.312141 0.62898
H  4.328582 0.567334 1.745216
H  5.036249 1.574975 0.47412
H  -0.04519 0.597561 -0.240151
H  1.08758 1.408847 -1.309661
H  0.566834 -0.127718 1.998405
H  1.546846 1.205905 2.567902
H  2.259076 -0.394442 2.40616
H  4.903094 -2.25791 -0.504968
H  4.493181 -1.831768 1.16104
H  5.916767 -1.137472 0.391789
H  3.992025 1.09944 -1.975041
H  5.593504 0.453579 -1.626731
H  4.393496 -0.564809 -2.409012
H  0.201122 2.579798 1.376508
H  1.088216 3.399376 0.110032
H  -0.87423 3.171905 -1.418063
H  -1.22505 4.086213 0.033727
H  0.461682 -2.16532 1.355207
H  0.069029 -1.539185 -2.787267
H  -2.232953 1.289574 -1.981325
H  -2.280838 2.757144 2.038664
H  -2.120658 -2.631587 0.588465
H  -3.981204 -0.333075 -1.414974
H  -4.0393 1.14739 2.609041
elementType: Cl O N C H
totalener: -1513.51985398 hartree
nucrepener: 2495.25268197 hartree
electener: -4008.77253595 hartree
oneelecener: -7027.91223159 hartree
twoeener: 3019.13969564 hartree
cpcmener: -0.02931193 hartree
kineticenergy: 1508.15819941 hartree
xcener: -124.307883738793 hartree
chargesum: 0.0000000
charge: -0.112065 -0.359955 -0.463056 -0.049329 -0.032493 -0.371476 0.201251 0.137496 0.076234 -0.112136 -0.354374 -0.322402 -0.355673 -0.164965 0.383676 -0.095542 0.043921 -0.161716 0.037926 -0.159582 -0.231762 -0.088915 -0.135596 -0.146512 0.099787 0.081204 0.110889 0.037863 0.108029 0.114643 0.116309 0.116969 0.107856 0.098623 0.112837 0.106584 0.104191 0.108496 0.089243 0.083959 0.086229 0.104483 0.193269 0.167683 0.133997 0.138475 0.150666 0.122676 0.142084
qa: -0.1121 -0.3600 -0.4631 -0.0493 -0.0325 -0.3715 0.2013 0.1375 0.0762 -0.1121 -0.3544 -0.3224 -0.3557 -0.1650 0.3837 -0.0955 0.0439 -0.1617 0.0379 -0.1596 -0.2318 -0.0889 -0.1356 -0.1465 0.0998 0.0812 0.1109 0.0379 0.1080 0.1146 0.1163 0.1170 0.1079 0.0986 0.1128 0.1066 0.1042 0.1085 0.0892 0.0840 0.0862 0.1045 0.1933 0.1677 0.1340 0.1385 0.1507 0.1227 0.1421
va: 1.1910 1.9777 2.0481 3.1166 3.2615 3.0819 4.0797 3.9315 3.8948 3.8002 3.9434 3.9139 3.9248 3.9167 4.2447 3.8465 3.5738 3.8963 4.0310 3.8854 3.9815 3.9909 3.9363 3.9879 3.7942 1.0022 0.9924 1.0313 1.0127 1.0017 1.0083 1.0027 1.0148 1.0044 0.9994 1.0071 1.0016 1.0205 1.0034 1.0302 1.0109 1.0036 0.9812 1.0019 1.0061 1.0032 1.0084 1.0259 1.0047
dispcorr: -0.031869842 hartree
energy: -1513.551723820688
dipole: 34.93742 -32.62680 2.31062 12.69394 -10.75751 1.93643 1.71255 -0.06986 1.64269
magnitude: 3.43324 au
magnitude: 8.72660 debye
