program: Orca
programVersion: 4.2.1
elementType: Cl O O N N N C C C C C C C C C C C C C C C C C C C H H H H H H H H H H H H H H H H H H H H H H H H
charge: 0
multiplicity: 1
keywords: wb97x-d3
keywords: def2-TZVPP
keywords: def2/J RIJCOSX GRIDX6 NOFINALGRIDX
keywords: grid4 nofinalgrid
keywords: scfconv7
keywords: smallprint printgap noloewdin
keywords: NOSOSCF
formula: C19H24ClN3O2
InChI: InChI=1S/C19H24ClN3O2/c1-18(2)13-25-19(3,23(18)17(24)22-12-11-21-14-22)10-4-5-15-6-8-16(20)9-7-15/h6-9,11-12,14H,4-5,10,13H2,1-3H3
49 atoms
Cl -4.711096 1.080861 -2.768231
O  2.478376 1.589194 0.257884
O  1.797824 -2.483347 -1.342725
N  2.302907 -0.617805 -0.155962
N  0.953035 -2.31717 0.754941
N  0.453429 -3.348624 2.632557
C  2.005302 0.422307 0.882755
C  3.16375 -0.048337 -1.221513
C  3.593547 1.23801 -0.523274
C  0.508009 0.604191 1.127423
C  2.783295 0.179973 2.173205
C  4.373352 -0.912237 -1.543166
C  2.359416 0.286101 -2.477117
C  0.134642 1.924125 1.794488
C  1.721294 -1.807972 -0.338513
C  -1.355251 1.967483 2.153226
C  -2.241504 1.758477 0.957738
C  -0.386342 -2.613351 0.689104
C  1.410397 -2.802177 1.939986
C  -2.401741 2.767476 0.010271
C  -2.871389 0.53865 0.728439
C  -0.675665 -3.225967 1.868472
C  -3.158873 2.570622 -1.133841
C  -3.633334 0.320381 -0.410769
C  -3.767738 1.341533 -1.336497
H  4.489479 1.083231 0.091465
H  3.802555 2.044568 -1.225844
H  0.141958 -0.209206 1.754951
H  -0.013178 0.524243 0.169937
H  3.82166 -0.091727 1.982755
H  2.338236 -0.606385 2.777464
H  2.782184 1.086856 2.778186
H  4.118025 -1.782822 -2.142964
H  4.873701 -1.251887 -0.635246
H  5.092068 -0.320886 -2.11381
H  3.001491 0.799386 -3.19475
H  1.969966 -0.604706 -2.964802
H  1.521182 0.946979 -2.25058
H  0.706002 2.070385 2.714374
H  0.373215 2.76433 1.139533
H  -1.575089 2.932868 2.615421
H  -1.568218 1.205984 2.907718
H  -0.996307 -2.341209 -0.155917
H  2.451232 -2.75564 2.219207
H  -1.927111 3.729899 0.162554
H  -2.76606 -0.265554 1.446969
H  -1.634485 -3.586654 2.20659
H  -3.271264 3.367433 -1.856859
H  -4.11271 -0.636261 -0.570466
elementType: Cl O N C H
totalener: -1513.52069740 hartree
nucrepener: 2463.80917876 hartree
electener: -3977.32987616 hartree
oneelecener: -6964.49278220 hartree
twoeener: 2987.16290604 hartree
cpcmener: -0.03076717 hartree
kineticenergy: 1508.16224292 hartree
xcener: -124.306500085434 hartree
chargesum: 0.0000000
charge: -0.105085 -0.361853 -0.455163 -0.045715 -0.027145 -0.372827 0.203944 0.137577 0.074299 -0.163812 -0.330304 -0.321386 -0.354236 -0.143882 0.366794 -0.099889 0.040519 -0.151144 0.023656 -0.202914 -0.195608 -0.112609 -0.148269 -0.148877 0.094522 0.081592 0.108507 0.079657 0.101890 0.111088 0.120228 0.112094 0.107754 0.099724 0.113417 0.105854 0.109356 0.106135 0.087901 0.082243 0.101635 0.090862 0.175503 0.181573 0.139864 0.133894 0.164064 0.142075 0.142497
qa: -0.1051 -0.3619 -0.4552 -0.0457 -0.0271 -0.3728 0.2039 0.1376 0.0743 -0.1638 -0.3303 -0.3214 -0.3542 -0.1439 0.3668 -0.0999 0.0405 -0.1511 0.0237 -0.2029 -0.1956 -0.1126 -0.1483 -0.1489 0.0945 0.0816 0.1085 0.0797 0.1019 0.1111 0.1202 0.1121 0.1078 0.0997 0.1134 0.1059 0.1094 0.1061 0.0879 0.0822 0.1016 0.0909 0.1755 0.1816 0.1399 0.1339 0.1641 0.1421 0.1425
va: 1.2005 1.9696 2.0554 3.1307 3.2517 3.1078 4.1181 3.9236 3.9035 3.8291 3.9655 3.9093 3.9266 3.8972 4.2535 3.8264 3.5563 3.9073 4.0365 3.9790 3.9278 4.0196 3.9775 3.9874 3.8238 1.0025 0.9938 1.0030 1.0080 1.0040 0.9982 1.0075 1.0154 1.0047 0.9992 1.0020 1.0183 1.0066 1.0170 1.0249 1.0064 1.0095 0.9995 0.9877 1.0035 1.0081 1.0021 1.0050 1.0052
dispcorr: -0.030047428 hartree
energy: -1513.550744824491
dipole: 28.80522 -27.15840 1.64682 6.20168 -4.03564 2.16604 10.98030 -10.49107 0.48923
magnitude: 2.76462 au
magnitude: 7.02710 debye
