program: Orca
programVersion: 4.2.1
elementType: Cl O O N N N C C C C C C C C C C C C C C C C C C C H H H H H H H H H H H H H H H H H H H H H H H H
charge: 0
multiplicity: 1
keywords: wb97x-d3
keywords: def2-TZVPP
keywords: def2/J RIJCOSX GRIDX6 NOFINALGRIDX
keywords: grid4 nofinalgrid
keywords: scfconv7
keywords: smallprint printgap noloewdin
keywords: NOSOSCF
formula: C19H24ClN3O2
InChI: InChI=1S/C19H24ClN3O2/c1-18(2)13-25-19(3,23(18)17(24)22-12-11-21-14-22)10-4-5-15-6-8-16(20)9-7-15/h6-9,11-12,14H,4-5,10,13H2,1-3H3
49 atoms
Cl -5.99443 1.467565 -2.026485
O  2.908529 1.641442 -0.270944
O  1.906216 -1.281023 2.464168
N  2.362885 -0.434752 0.409809
N  1.605071 -2.642442 0.67266
N  1.542573 -4.82645 0.414745
C  2.609073 0.94678 0.914028
C  2.789586 -0.560904 -1.008874
C  3.576664 0.748171 -1.1245
C  1.370662 1.587853 1.536419
C  3.798211 1.004875 1.869557
C  3.71079 -1.740619 -1.284617
C  1.619961 -0.546015 -1.98738
C  0.10633 1.510344 0.693965
C  1.98045 -1.392146 1.258526
C  -1.084454 2.176329 1.386027
C  -2.33769 2.0295 0.571743
C  0.429944 -2.922111 0.017507
C  2.220307 -3.831084 0.907837
C  -2.716481 3.001391 -0.349884
C  -3.119358 0.880843 0.673268
C  0.418579 -4.274128 -0.135723
C  -3.837949 2.839595 -1.150634
C  -4.243284 0.699044 -0.118026
C  -4.59233 1.68414 -1.028334
H  4.623788 0.606901 -0.826668
H  3.567303 1.148346 -2.138287
H  1.622905 2.635865 1.726127
H  1.192363 1.142655 2.516032
H  4.028661 2.048226 2.089033
H  4.690353 0.546629 1.440509
H  3.588256 0.505408 2.811413
H  4.464866 -1.861919 -0.505961
H  4.237879 -1.558556 -2.223258
H  3.176089 -2.680653 -1.406154
H  1.01613 -1.448481 -1.924049
H  0.970316 0.315385 -1.836191
H  2.005935 -0.494909 -3.006711
H  0.265658 1.985294 -0.276907
H  -0.151899 0.467236 0.490676
H  -0.867549 3.23452 1.552675
H  -1.229446 1.726656 2.372083
H  -0.290574 -2.164549 -0.240437
H  3.166382 -3.893032 1.423211
H  -2.128714 3.906246 -0.449872
H  -2.850803 0.10843 1.384576
H  -0.343285 -4.875654 -0.606225
H  -4.116417 3.60809 -1.859267
H  -4.837644 -0.19973 -0.021712
elementType: Cl O N C H
totalener: -1513.52311276 hartree
nucrepener: 2398.63361097 hartree
electener: -3912.15672373 hartree
oneelecener: -6833.94635666 hartree
twoeener: 2921.78963293 hartree
cpcmener: -0.03105508 hartree
kineticenergy: 1508.15921738 hartree
xcener: -124.305041553736 hartree
chargesum: -0.0000000
charge: -0.105771 -0.379974 -0.449292 -0.047752 -0.018404 -0.371101 0.299376 0.101510 0.081182 -0.217548 -0.311642 -0.343924 -0.361278 -0.108764 0.336662 -0.070428 0.043124 -0.152515 0.030265 -0.216472 -0.234571 -0.125231 -0.141073 -0.139876 0.081007 0.082860 0.109603 0.100663 0.096713 0.108723 0.099446 0.109858 0.113413 0.121153 0.103769 0.120292 0.121921 0.112543 0.085529 0.058128 0.088561 0.093888 0.183805 0.175523 0.140312 0.142253 0.167737 0.142467 0.143332
qa: -0.1058 -0.3800 -0.4493 -0.0478 -0.0184 -0.3711 0.2994 0.1015 0.0812 -0.2175 -0.3116 -0.3439 -0.3613 -0.1088 0.3367 -0.0704 0.0431 -0.1525 0.0303 -0.2165 -0.2346 -0.1252 -0.1411 -0.1399 0.0810 0.0829 0.1096 0.1007 0.0967 0.1087 0.0994 0.1099 0.1134 0.1212 0.1038 0.1203 0.1219 0.1125 0.0855 0.0581 0.0886 0.0939 0.1838 0.1755 0.1403 0.1423 0.1677 0.1425 0.1433
va: 1.2001 1.9855 2.0622 3.1309 3.2429 3.1169 4.0373 3.9120 3.8935 3.7739 3.9433 3.9526 3.9330 3.8839 4.2703 3.8086 3.5743 3.9165 4.0431 3.9837 3.9764 4.0584 3.9703 3.9700 3.8323 1.0041 0.9927 1.0205 1.0286 1.0077 1.0046 1.0202 1.0003 1.0028 0.9963 1.0005 0.9977 1.0054 1.0274 1.0178 1.0114 1.0071 0.9813 0.9978 1.0044 1.0032 1.0021 1.0052 1.0046
dispcorr: -0.028829165 hartree
energy: -1513.551941925701
dipole: 32.34568 -30.69033 1.65534 2.61569 -0.82655 1.78914 2.95652 -3.99811 -1.04158
magnitude: 2.65067 au
magnitude: 6.73748 debye
