program: Gaussian 09
title: 000003128
version: EM64L-G09RevD.01
frameworkgroup: C1[X(C10H14ClN)]
method: RPBEPBE
basis: SDD
operation: Freq
keyword: #p
keyword: freq=noraman
keyword: PBEPBE/SDD
title: #p freq=noraman PBEPBE/SDD
converged: YES YES NO NO
title: Mulliken charges:
elementType: Cl N C C C C C C C C C C H H H H H H H H H H H H H H
charge: -0.065239 -0.313281 -0.025708 -0.610388 0.515883 -0.708334 -0.411947 -0.386610 -0.638817 -0.216291 -0.218567 -0.105487 0.196981 0.235100 0.197122 0.220967 0.219629 0.231636 0.253671 0.243370 0.236899 0.219159 0.233374 0.190658 0.253505 0.252716
chargesum: 0.00000
title: Mulliken charges with hydrogens summed into heavy atoms:
elementType: Cl N C C C C C C C C C C
charge: -0.065239 -0.059610 0.171272 -0.178166 0.515883 -0.036102 -0.168577 -0.149711 0.004375 0.037214 0.034149 -0.105487
polarizability: 1.79701108e+02 3.36115579e+00 1.10122841e+02 1.29167618e+01 -4.93045744e+00 8.02556770e+01
1716.lowfreq: -8.2407 -7.6452 -0.0011 0.0012 0.0019 11.7312 39.2683 46.1577 51.7081
frequency: 38.5095 46.1155 51.6248 96.0667 145.0479 195.9584 213.3707 230.0610 261.4794 300.3946 315.7326 368.5356 405.7784 408.8897 436.2471 449.3230 520.0988 627.0190 637.1528 657.7236 714.9724 799.7079 811.4702 829.5842 852.7262 889.0877 918.9210 949.7632 964.8408 1000.2889 1037.8527 1052.8896 1071.1714 1081.2585 1102.5159 1118.7809 1170.0273 1183.2194 1184.0938 1211.9553 1221.9019 1285.5760 1295.7219 1330.5563 1340.1167 1375.8389 1377.7767 1394.3515 1435.2220 1456.3614 1463.2403 1470.6979 1474.9105 1477.7689 1485.2274 1496.6286 1586.3437 1600.3742 2828.9106 2872.2019 2964.9626 2985.4266 3025.5001 3046.7802 3077.4592 3084.0895 3090.1589 3127.0596 3133.6658 3167.0653 3170.5624 3436.0426
redmass: 3.2971 3.3156 5.0856 2.1801 4.9732 1.0391 2.2865 4.3660 1.8510 5.3951 2.3805 2.4082 4.7204 3.0417 2.7763 2.2540 2.6601 6.8460 3.1481 1.8628 3.4808 2.1690 2.7283 1.2508 2.0988 1.3775 1.9295 1.3658 1.3700 4.2985 1.8436 1.5469 2.7394 1.9819 1.3394 1.3180 2.8157 1.1268 1.8279 1.7629 2.0250 1.3054 1.2808 1.4091 1.4253 3.8642 1.4210 2.6304 1.1612 1.1578 1.0568 1.1662 1.1127 2.2248 1.0529 1.0491 7.3036 6.3195 1.0810 1.0564 1.0645 1.0355 1.0738 1.0967 1.1002 1.0993 1.0994 1.0897 1.0897 1.0950 1.0961 1.0743
irintensity: 0.3450 0.5652 0.4191 2.7136 0.1208 0.5513 1.5305 0.1471 0.3662 1.5948 0.8617 0.7150 8.5136 0.8967 4.4744 23.7428 48.5375 0.2165 28.6515 60.4651 4.1542 37.4569 13.1966 0.0590 31.1610 1.1277 0.7681 0.2284 0.1727 36.7146 6.2820 8.2400 34.5791 5.2583 3.3839 9.3462 57.1857 1.9340 1.6647 4.5732 6.1968 2.9259 0.7404 16.3947 28.8211 4.2109 18.8480 4.0270 3.5126 22.8058 7.0502 16.6166 4.2555 70.5807 10.4878 23.0580 1.0684 5.2044 87.7524 140.3733 43.2312 16.3177 51.1174 18.6709 40.5538 35.5705 30.1494 12.6168 11.1704 8.0363 0.6063 2.5444
temp: 298.150 k
press: 1.00000 atm
elementType: 17 7 6 6 6 6 6 6 6 6 6 6 1 1 1 1 1 1 1 1 1 1 1 1 1 1
symmnumber: 1
zpe: 567800.1 jmol-1
zpe.correction: 0.216264 hartree
zpe.thermalcorrener: 0.229044 hartree
zpe.thermalcorrenthalpy: 0.229988 hartree
zpe.thermalcorrgfe: 0.175844 hartree
zpe.sumelectzpe: -903.348802 hartree
zpe.sumelectthermal: -903.336021 hartree
zpe.sumelectthermalent: -903.335077 hartree
zpe.sumelectthermalfe: -903.389221 hartree
dipole: -2.4797 -0.9610 -0.2137
dipole: 2.6680
quadrupole: -86.8660 -73.3716 -81.9508
quadrupole: 5.3823 -1.5702 -0.1449
quadrupole: -6.1365 7.3579 -1.2213 5.3823 -1.5702 -0.1449
hfenergy: -903.5650654 hartree
pointgroup: C01[X(C10H14Cl1N1)]
dipole: 0.9720602 0.3960344 0.0081776 debye
dipolederiv: -0.8601507 -0.0451923 0.1820308 -0.0562103 -0.1258223 -0.0095502 0.2145369 -0.0106815 -0.1400868 -0.8328252 -0.0364164 -0.014994 0.0626543 -0.2489154 -0.1719328 -0.0659788 -0.1022251 -0.5770268 0.6468292 0.0377517 -0.1170433 0.0844736 0.3261977 0.0657516 -0.0078538 0.0402872 0.2774685 -0.1521061 -0.0181451 -0.0373467 0.019939 0.132812 0.0067016 -0.1869324 0.0193629 0.0876913 0.3678831 -0.0032321 -0.0347379 0.0325953 -0.0793631 -0.0163951 -0.1219697 -0.010036 -0.0766856 -0.0473528 -0.032159 -0.0108707 -0.0430173 -0.1053864 0.0773913 0.00333 0.0945239 0.0288985 -0.0729143 -0.0102651 -0.0560361 -0.0119714 0.0372708 0.0940957 -0.0313988 0.084525 -0.0899704 -0.04832 0.0488676 -0.0289978 0.0632164 0.0324643 0.0790663 0.0162618 0.0823164 -0.1013871 0.3121126 -0.0053551 0.1245216 -0.1348262 0.2137391 0.0682251 0.2426558 0.1121569 0.4073839 -0.2826604 0.043533 0.0672772 0.0544108 -0.0085161 0.0355688 0.0767669 0.0368731 -0.1021751 -0.3068578 -0.04599 0.0255944 -0.0725157 -0.0167672 0.0583405 0.0203123 0.0602473 -0.0806749 1.1811012 0.085817 -0.3162704 0.1037116 0.0665454 0.0448659 -0.3366041 0.0458246 0.0468641 -0.1135568 0.0250437 0.0459345 0.0888287 -0.1105643 -0.1290338 0.1456453 -0.0854881 -0.1438621 0.0338982 0.0088392 0.0261412 0.0339126 -0.0082867 -0.1289963 0.0397619 -0.0658384 -0.0313825 -0.0125133 -0.038272 0.0392785 -0.0720344 -0.137418 0.1149125 0.0358343 0.0573437 0.0329516 -0.0160749 0.0665878 -0.1361299 0.0465578 0.0643569 0.0243421 -0.1547973 0.0440736 -0.0670576 0.088825 0.046053 0.0365469 0.0351417 -0.0123908 -0.0644697 0.0535187 -0.1313264 -0.0434862 -0.1029398 -0.0789241 0.0760259 -0.0808511 0.063594 -0.0006499 0.1043443 -0.0115587 0.0788814 0.1325836 0.0221366 -0.0684119 -0.0237072 -0.0215548 0.1826714 -0.0381084 0.066149 0.2214443 0.0366418 0.0661183 0.0780929 0.0543291 0.0050265 -0.0798383 0.0745772 -0.0839325 0.0815947 0.0128809 -0.1090851 -0.0049378 -0.1054194 -0.0126339 -0.0513664 -0.00727 -0.0480901 0.1110874 -0.1674547 -0.0747517 0.0483247 -0.1208399 0.0736804 0.0163585 0.0897916 0.04713 0.0366351 0.1031226 0.0177464 -0.0173403 0.0867406 -0.1392639 0.081881 -0.0806126 0.0490805 0.0231682 -0.0037113 0.0588015 0.0507347 -0.008382 -0.0381165 -0.1647484 -0.1433938 -0.1572225 -0.2253258 0.0441411 -0.0764389 -0.0085243 -0.0797148 0.0187453 -0.0545294 -0.000195 -0.0522375 0.1374426 0.059419 0.0469312 0.0511379 0.0429782 0.0305669 -0.0786622 0.0577778 -0.0812572 0.1076093 unknown
polarizability: 179.2038466|7.6485845|105.4394977|-13.000862|11.8213797|85.4362822 unknown
InChI: InChI=1S/C10H14ClN/c1-8(12-2)7-9-3-5-10(11)6-4-9/h3-6,8,12H,7H2,1-2H3
charge 0 multiplicity 1
26 atoms
Cl -4.683287 -0.115936 0.667322
N  3.60886 0.32177 -0.250913
C  2.235173 0.026143 0.226125
C  1.259207 0.292331 -0.960274
C  -0.208145 0.193977 -0.578637
C  2.132997 -1.426801 0.732139
C  -0.983761 -0.942031 -0.923871
C  -0.835955 1.234984 0.155017
C  4.675894 0.287115 0.768169
C  -2.343627 -1.048133 -0.550578
C  -2.192829 1.151661 0.538849
C  -2.926183 0.004655 0.178939
H  1.939703 0.705741 1.069319
H  1.507061 -0.42278 -1.766392
H  1.470104 1.309219 -1.353322
H  2.777666 -1.5945 1.612827
H  2.448467 -2.124215 -0.065432
H  1.095605 -1.662511 1.026948
H  3.627995 1.202898 -0.782597
H  -0.522994 -1.757168 -1.493739
H  -0.262105 2.129642 0.425687
H  5.617763 0.650465 0.319974
H  4.854055 -0.749289 1.104778
H  4.461785 0.90527 1.675051
H  -2.933935 -1.927875 -0.823174
H  -2.669614 1.960567 1.100188
