program: Orca
programVersion: 4.2.1
elementType: Cl O O N N N C C C C C C C C C C C C C C C C C C C H H H H H H H H H H H H H H H H H H H H H H H H
charge: 0
multiplicity: 1
keywords: wb97x-d3
keywords: def2-TZVPP
keywords: def2/J RIJCOSX GRIDX6 NOFINALGRIDX
keywords: grid4 nofinalgrid
keywords: scfconv7
keywords: smallprint printgap noloewdin
keywords: NOSOSCF
formula: C19H24ClN3O2
InChI: InChI=1S/C19H24ClN3O2/c1-18(2)13-25-19(3,23(18)17(24)22-12-11-21-14-22)10-4-5-15-6-8-16(20)9-7-15/h6-9,11-12,14H,4-5,10,13H2,1-3H3
49 atoms
Cl -4.597233 -1.168946 0.210295
O  3.346786 1.628315 0.385901
O  0.19086 -0.678324 1.699087
N  1.851888 -0.048218 0.281699
N  0.384045 -1.806286 -0.253373
N  -0.359549 -3.77883 -0.886194
C  2.243477 1.135868 1.102063
C  2.9469 -0.410366 -0.661129
C  4.041489 0.511968 -0.10902
C  1.160538 2.206869 1.133336
C  2.666483 0.753815 2.521081
C  3.391557 -1.862973 -0.5616
C  2.658872 -0.035054 -2.111631
C  0.756243 2.780692 -0.220568
C  0.806258 -0.798061 0.662333
C  -0.661109 3.369733 -0.203412
C  -1.703789 2.292536 -0.095537
C  -0.129747 -1.640149 -1.516854
C  0.192411 -3.110682 0.082944
C  -2.064851 1.55493 -1.221824
C  -2.279317 1.945831 1.123052
C  -0.57972 -2.86923 -1.885424
C  -2.954318 0.495788 -1.139997
C  -3.1677 0.885063 1.227873
C  -3.493741 0.164143 0.092566
H  4.622299 0.011873 0.676594
H  4.736349 0.837678 -0.883227
H  1.514674 3.014161 1.780841
H  0.296986 1.782804 1.645041
H  3.156049 1.611237 2.984932
H  3.367671 -0.0813 2.537432
H  1.816449 0.482119 3.140307
H  4.380271 -1.96006 -1.01432
H  2.734672 -2.5467 -1.096728
H  3.474081 -2.194602 0.474316
H  2.337552 1.001871 -2.212602
H  3.571412 -0.155816 -2.697776
H  1.908238 -0.675818 -2.567518
H  1.462359 3.55517 -0.525779
H  0.793467 2.010489 -0.995031
H  -0.817529 3.940681 -1.121598
H  -0.759687 4.077908 0.623645
H  -0.181141 -0.682402 -2.00282
H  0.503885 -3.507467 1.036786
H  -1.643514 1.808583 -2.187999
H  -2.032865 2.507731 2.016024
H  -1.058219 -3.143238 -2.812582
H  -3.217289 -0.065706 -2.026229
H  -3.596495 0.628497 2.187279
elementType: Cl O N C H
totalener: -1513.51894174 hartree
nucrepener: 2560.72161858 hartree
electener: -4074.24056031 hartree
oneelecener: -7159.13619974 hartree
twoeener: 3084.89563942 hartree
cpcmener: -0.03082837 hartree
kineticenergy: 1508.16127322 hartree
xcener: -124.308966968707 hartree
chargesum: -0.0000000
charge: -0.110302 -0.381957 -0.442227 -0.027818 0.021777 -0.367438 0.252428 0.099633 0.089647 -0.186472 -0.321849 -0.341400 -0.368457 -0.123915 0.331508 -0.108360 0.110884 -0.188402 0.027432 -0.273021 -0.220507 -0.114075 -0.155619 -0.138920 0.118806 0.083448 0.109340 0.105949 0.092458 0.108268 0.099730 0.111023 0.120033 0.104884 0.112379 0.122743 0.115274 0.116146 0.086229 0.051999 0.097343 0.088938 0.185629 0.169785 0.148113 0.145022 0.165056 0.138375 0.140460
qa: -0.1103 -0.3820 -0.4422 -0.0278 0.0218 -0.3674 0.2524 0.0996 0.0896 -0.1865 -0.3218 -0.3414 -0.3685 -0.1239 0.3315 -0.1084 0.1109 -0.1884 0.0274 -0.2730 -0.2205 -0.1141 -0.1556 -0.1389 0.1188 0.0834 0.1093 0.1059 0.0925 0.1083 0.0997 0.1110 0.1200 0.1049 0.1124 0.1227 0.1153 0.1161 0.0862 0.0520 0.0973 0.0889 0.1856 0.1698 0.1481 0.1450 0.1651 0.1384 0.1405
va: 1.1944 1.9751 2.0602 3.1224 3.2353 3.1216 4.1218 3.9036 3.8754 3.7274 3.9422 3.9565 3.9301 3.9122 4.2373 3.8925 3.5171 3.9395 4.0574 3.9227 3.9499 4.0632 3.9192 3.9884 3.7778 1.0035 0.9928 1.0180 1.0327 1.0104 1.0037 1.0189 1.0030 0.9963 0.9998 0.9966 1.0043 1.0037 1.0204 1.0186 1.0059 1.0074 0.9782 1.0017 0.9994 0.9973 1.0030 1.0075 1.0045
dispcorr: -0.033452318 hartree
energy: -1513.552394053468
dipole: 32.29268 -29.58074 2.71194 13.30194 -11.33741 1.96453 -3.36314 2.57803 -0.78511
magnitude: 3.43953 au
magnitude: 8.74259 debye
