program: Orca
programVersion: 4.2.1
elementType: Cl O O N N N C C C C C C C C C C C C C C C C C C C H H H H H H H H H H H H H H H H H H H H H H H H
charge: 0
multiplicity: 1
keywords: wb97x-d3
keywords: def2-TZVPP
keywords: def2/J RIJCOSX GRIDX6 NOFINALGRIDX
keywords: grid4 nofinalgrid
keywords: scfconv7
keywords: smallprint printgap noloewdin
keywords: NOSOSCF
formula: C19H24ClN3O2
InChI: InChI=1S/C19H24ClN3O2/c1-18(2)13-25-19(3,23(18)17(24)22-12-11-21-14-22)10-4-5-15-6-8-16(20)9-7-15/h6-9,11-12,14H,4-5,10,13H2,1-3H3
49 atoms
Cl -5.654681 4.025258 1.193584
O  1.127007 1.169046 0.523847
O  1.21999 -2.879706 1.349407
N  1.828082 -0.957353 0.303239
N  2.697756 -3.031185 -0.366774
N  3.264846 -4.229532 -2.123649
C  0.860217 -0.104784 1.053189
C  2.828992 -0.11657 -0.40781
C  2.50139 1.231375 0.2442
C  -0.598659 -0.462107 0.776675
C  1.137645 -0.11112 2.556033
C  4.276844 -0.487332 -0.116611
C  2.580189 -0.035129 -1.910054
C  -1.04176 -0.555609 -0.680628
C  1.855149 -2.277666 0.509841
C  -1.309752 0.764568 -1.414972
C  -2.387152 1.592193 -0.773175
C  3.728652 -3.844874 0.035479
C  2.447878 -3.324231 -1.671659
C  -3.731147 1.337719 -1.03882
C  -2.080617 2.614559 0.121921
C  4.077917 -4.553887 -1.071382
C  -4.740935 2.076057 -0.440336
C  -3.075717 3.364821 0.732107
C  -4.401806 3.08819 0.443598
H  3.095137 1.384559 1.15415
H  2.690892 2.070889 -0.424183
H  -1.211098 0.269334 1.312118
H  -0.80545 -1.414299 1.264785
H  0.516232 0.646806 3.03521
H  2.179901 0.116315 2.783632
H  0.901208 -1.069574 3.010103
H  4.439963 -0.689608 0.942866
H  4.915112 0.355332 -0.389567
H  4.624394 -1.34346 -0.69174
H  1.549433 0.234523 -2.140287
H  3.227012 0.729997 -2.342017
H  2.811994 -0.966506 -2.421926
H  -0.317537 -1.134859 -1.260572
H  -1.962566 -1.144561 -0.703451
H  -1.608722 0.519855 -2.437219
H  -0.396314 1.352563 -1.494506
H  4.124142 -3.823856 1.037208
H  1.636799 -2.869431 -2.218831
H  -4.002996 0.551533 -1.733705
H  -1.045704 2.833799 0.353424
H  4.871583 -5.278377 -1.165978
H  -5.777412 1.86564 -0.667862
H  -2.813853 4.15639 1.421425
elementType: Cl O N C H
totalener: -1513.51917200 hartree
nucrepener: 2411.00080555 hartree
electener: -3924.51997756 hartree
oneelecener: -6858.69634100 hartree
twoeener: 2934.17636344 hartree
cpcmener: -0.02974992 hartree
kineticenergy: 1508.15622647 hartree
xcener: -124.306595783416 hartree
chargesum: 0.0000000
charge: -0.106417 -0.363434 -0.451144 -0.036566 -0.022997 -0.377199 0.236380 0.107168 0.076684 -0.180200 -0.317190 -0.339655 -0.367985 -0.182729 0.344256 -0.065226 0.044712 -0.156292 0.032658 -0.217324 -0.249048 -0.109213 -0.147786 -0.129189 0.083438 0.086090 0.105286 0.110763 0.121157 0.108108 0.099844 0.108946 0.112111 0.120298 0.105891 0.119544 0.113442 0.122653 0.080086 0.103898 0.098964 0.086919 0.183504 0.173225 0.139504 0.145551 0.164951 0.142077 0.141484
qa: -0.1064 -0.3634 -0.4511 -0.0366 -0.0230 -0.3772 0.2364 0.1072 0.0767 -0.1802 -0.3172 -0.3397 -0.3680 -0.1827 0.3443 -0.0652 0.0447 -0.1563 0.0327 -0.2173 -0.2490 -0.1092 -0.1478 -0.1292 0.0834 0.0861 0.1053 0.1108 0.1212 0.1081 0.0998 0.1089 0.1121 0.1203 0.1059 0.1195 0.1134 0.1227 0.0801 0.1039 0.0990 0.0869 0.1835 0.1732 0.1395 0.1456 0.1650 0.1421 0.1415
va: 1.1991 1.9541 2.0602 3.1225 3.2445 3.1091 4.0779 3.9235 3.8771 3.7307 3.9422 3.9492 3.9415 3.9473 4.2702 3.7743 3.5763 3.9181 4.0402 4.0023 3.9293 4.0111 3.9768 3.9863 3.8287 1.0026 0.9948 1.0069 1.0254 1.0080 1.0041 1.0212 1.0006 1.0033 0.9946 0.9955 1.0049 0.9996 1.0182 1.0080 1.0052 1.0234 0.9943 0.9905 1.0041 1.0242 1.0005 1.0050 1.0059
dispcorr: -0.030450068 hartree
energy: -1513.549622072556
dipole: 27.78542 -26.10584 1.67957 -7.95172 9.43648 1.48476 -5.19904 5.21455 0.01550
magnitude: 2.24181 au
magnitude: 5.69824 debye
