program: Orca
programVersion: 4.2.1
elementType: Cl O O N N N C C C C C C C C C C C C C C C C C C C H H H H H H H H H H H H H H H H H H H H H H H H
charge: 0
multiplicity: 1
keywords: wb97x-d3
keywords: def2-TZVPP
keywords: def2/J RIJCOSX GRIDX6 NOFINALGRIDX
keywords: grid4 nofinalgrid
keywords: scfconv7
keywords: smallprint printgap noloewdin
keywords: NOSOSCF
formula: C19H24ClN3O2
InChI: InChI=1S/C19H24ClN3O2/c1-18(2)13-25-19(3,23(18)17(24)22-12-11-21-14-22)10-4-5-15-6-8-16(20)9-7-15/h6-9,11-12,14H,4-5,10,13H2,1-3H3
49 atoms
Cl -6.000466 1.73494 -1.876933
O  2.877923 1.695508 0.032666
O  1.984465 -1.653085 2.275664
N  2.364637 -0.468571 0.376133
N  1.664248 -2.706153 0.291442
N  0.386428 -4.092141 -0.84503
C  2.577999 0.822143 1.092227
C  2.834552 -0.370279 -1.032644
C  3.590928 0.958247 -0.926795
C  1.31702 1.332162 1.784929
C  3.754488 0.76232 2.064641
C  3.790759 -1.479757 -1.446346
C  1.698618 -0.225038 -2.040255
C  0.075494 1.396905 0.907988
C  2.028073 -1.562567 1.066942
C  -1.146093 1.893849 1.683377
C  -2.380977 1.873777 0.828722
C  2.245579 -3.945989 0.398591
C  0.534851 -2.861451 -0.451918
C  -3.122072 0.703132 0.682208
C  -2.784682 2.998817 0.11561
C  1.456037 -4.776544 -0.33355
C  -4.233092 0.649324 -0.145387
C  -3.893953 2.96656 -0.717426
C  -4.610141 1.787301 -0.841062
H  4.63375 0.797628 -0.624775
H  3.595576 1.507816 -1.868033
H  1.550069 2.330106 2.169405
H  1.119945 0.714277 2.662318
H  4.653335 0.356429 1.598137
H  3.533896 0.158137 2.940121
H  3.981515 1.773303 2.40584
H  4.333006 -1.15926 -2.337999
H  3.284085 -2.408092 -1.70434
H  4.530264 -1.689051 -0.672168
H  2.117877 0.011698 -3.019274
H  1.124527 -1.140724 -2.16063
H  1.013549 0.578262 -1.769939
H  0.245976 2.05252 0.050836
H  -0.15325 0.407846 0.501532
H  -0.961271 2.906523 2.050667
H  -1.296446 1.263666 2.564133
H  3.158251 -4.110925 0.946157
H  -0.153227 -2.050898 -0.634063
H  -2.83323 -0.188645 1.226286
H  -2.228295 3.923928 0.208928
H  1.599682 -5.829649 -0.517813
H  -4.796458 -0.269174 -0.24192
H  -4.193273 3.853251 -1.259987
elementType: Cl O N C H
totalener: -1513.52316996 hartree
nucrepener: 2397.17318301 hartree
electener: -3910.69635297 hartree
oneelecener: -6831.27910157 hartree
twoeener: 2920.58274859 hartree
cpcmener: -0.03055550 hartree
kineticenergy: 1508.15777918 hartree
xcener: -124.304849924664 hartree
chargesum: 0.0000000
charge: -0.105722 -0.380079 -0.449733 -0.055601 -0.020434 -0.376414 0.291838 0.091406 0.083158 -0.211759 -0.313568 -0.333799 -0.359999 -0.109464 0.344458 -0.073063 0.037795 -0.152140 0.033736 -0.233588 -0.210318 -0.109045 -0.139379 -0.145919 0.083558 0.082735 0.109880 0.101665 0.096866 0.100315 0.109749 0.109968 0.120256 0.104506 0.112645 0.112703 0.120048 0.122360 0.086299 0.054549 0.088498 0.095119 0.182997 0.168482 0.143171 0.140477 0.165229 0.143089 0.142473
qa: -0.1057 -0.3801 -0.4497 -0.0556 -0.0204 -0.3764 0.2918 0.0914 0.0832 -0.2118 -0.3136 -0.3338 -0.3600 -0.1095 0.3445 -0.0731 0.0378 -0.1521 0.0337 -0.2336 -0.2103 -0.1090 -0.1394 -0.1459 0.0836 0.0827 0.1099 0.1017 0.0969 0.1003 0.1097 0.1100 0.1203 0.1045 0.1126 0.1127 0.1200 0.1224 0.0863 0.0545 0.0885 0.0951 0.1830 0.1685 0.1432 0.1405 0.1652 0.1431 0.1425
va: 1.1995 1.9846 2.0642 3.1267 3.2441 3.1129 4.0518 3.9300 3.8883 3.7720 3.9414 3.9452 3.9349 3.8815 4.2586 3.8065 3.5758 3.9192 4.0485 3.9758 3.9793 4.0107 3.9726 3.9713 3.8268 1.0041 0.9930 1.0190 1.0272 1.0041 1.0207 1.0086 1.0031 0.9954 1.0007 1.0053 0.9997 0.9964 1.0275 1.0206 1.0115 1.0063 0.9951 0.9909 1.0027 1.0039 1.0004 1.0048 1.0054
dispcorr: -0.028732423 hartree
energy: -1513.551902387873
dipole: 34.29761 -31.70303 2.59458 1.22615 0.12141 1.34757 4.74953 -5.06866 -0.31913
magnitude: 2.94102 au
magnitude: 7.47548 debye
