program: Orca
programVersion: 4.2.1
elementType: Cl O O N N N C C C C C C C C C C C C C C C C C C C H H H H H H H H H H H H H H H H H H H H H H H H
charge: 0
multiplicity: 1
keywords: wb97x-d3
keywords: def2-TZVPP
keywords: def2/J RIJCOSX GRIDX6 NOFINALGRIDX
keywords: grid4 nofinalgrid
keywords: scfconv7
keywords: smallprint printgap noloewdin
keywords: NOSOSCF
formula: C19H24ClN3O2
InChI: InChI=1S/C19H24ClN3O2/c1-18(2)13-25-19(3,23(18)17(24)22-12-11-21-14-22)10-4-5-15-6-8-16(20)9-7-15/h6-9,11-12,14H,4-5,10,13H2,1-3H3
49 atoms
Cl -4.630054 1.801491 -2.913504
O  2.369615 1.435172 0.386699
O  2.80066 -2.734614 -0.910353
N  2.034872 -0.711983 -0.204607
N  1.52588 -2.681856 0.967215
N  -0.117353 -3.558748 2.149932
C  1.825418 0.254976 0.919252
C  2.470991 0.008041 -1.421093
C  2.113402 1.430333 -0.991474
C  0.33241 0.457363 1.227257
C  2.631947 -0.084234 2.161854
C  3.978606 -0.088481 -1.663108
C  1.681038 -0.416826 -2.64991
C  0.008642 1.761613 1.945739
C  2.190251 -2.0512 -0.127081
C  -1.492322 1.897565 2.224522
C  -2.314241 1.882952 0.965699
C  2.100622 -3.591144 1.821923
C  0.181093 -2.731112 1.197353
C  -2.283553 2.963994 0.088255
C  -3.084663 0.779846 0.614593
C  1.072884 -4.093698 2.557464
C  -2.991401 2.948508 -1.1020
C  -3.800054 0.744794 -0.573299
C  -3.746363 1.832281 -1.428347
H  2.741885 2.182037 -1.469469
H  1.063446 1.668614 -1.215034
H  -0.020158 -0.372014 1.84221
H  -0.237342 0.40809 0.295238
H  2.64159 0.776341 2.830183
H  3.665466 -0.314361 1.903404
H  2.210205 -0.922644 2.710691
H  4.539794 0.253217 -0.792891
H  4.250622 0.55011 -2.505407
H  4.288162 -1.102192 -1.899244
H  1.900602 0.257745 -3.479255
H  1.937704 -1.424306 -2.970103
H  0.607382 -0.375069 -2.461655
H  0.544196 1.818476 2.896739
H  0.344993 2.615156 1.354115
H  -1.667295 2.829002 2.768948
H  -1.817761 1.090297 2.885819
H  3.160196 -3.778549 1.829714
H  -0.521763 -2.166055 0.60566
H  -1.698057 3.841274 0.338175
H  -3.130869 -0.073958 1.280464
H  1.123931 -4.815216 3.356857
H  -2.961077 3.798428 -1.769879
H  -4.394664 -0.121262 -0.829434
totalener: -1513.49304021 hartree
nucrepener: 2443.87878769 hartree
electener: -3957.37182790 hartree
oneelecener: -6924.38667563 hartree
twoeener: 2967.01484773 hartree
kineticenergy: 1508.19714009 hartree
xcener: -124.308123735643 hartree
chargesum: 0.0000000
charge: -0.080939 -0.336246 -0.360731 -0.093343 -0.032378 -0.299174 0.376854 0.110644 0.042491 -0.326434 -0.315134 -0.332582 -0.307646 -0.143033 0.316578 -0.121827 0.060910 -0.133430 0.015811 -0.209216 -0.169707 -0.071607 -0.120350 -0.125314 0.079965 0.097285 0.070594 0.105797 0.090944 0.107398 0.107234 0.108463 0.101736 0.088679 0.121144 0.097603 0.120615 0.090194 0.083602 0.087040 0.100726 0.087402 0.147830 0.145747 0.116123 0.122162 0.129400 0.122316 0.125806
qa: -0.0809 -0.3362 -0.3607 -0.0933 -0.0324 -0.2992 0.3769 0.1106 0.0425 -0.3264 -0.3151 -0.3326 -0.3076 -0.1430 0.3166 -0.1218 0.0609 -0.1334 0.0158 -0.2092 -0.1697 -0.0716 -0.1204 -0.1253 0.0800 0.0973 0.0706 0.1058 0.0909 0.1074 0.1072 0.1085 0.1017 0.0887 0.1211 0.0976 0.1206 0.0902 0.0836 0.0870 0.1007 0.0874 0.1478 0.1457 0.1161 0.1222 0.1294 0.1223 0.1258
va: 1.2255 2.0051 2.1393 3.0703 3.2739 3.1180 3.9560 4.0068 3.9583 3.9137 3.9635 3.9160 3.9152 3.8879 4.2713 3.8321 3.5758 3.9182 4.0400 4.0037 3.9462 4.0217 3.9981 4.0106 3.9316 0.9960 0.9960 1.0139 1.0149 1.0114 1.0075 0.9925 1.0079 1.0051 1.0226 1.0035 1.0129 1.0068 1.0179 1.0230 1.0067 1.0132 1.0107 0.9969 1.0103 1.0085 1.0080 1.0112 1.0102
dispcorr: -0.029539919 hartree
energy: -1513.522580129360
dipole: 23.96592 -23.25763 0.70829 3.78046 -2.31749 1.46298 10.61078 -10.29930 0.31148
magnitude: 1.65499 au
magnitude: 4.20665 debye
