program: Orca
programVersion: 4.2.1
elementType: Cl O O N N N C C C C C C C C C C C C C C C C C C C H H H H H H H H H H H H H H H H H H H H H H H H
charge: 0
multiplicity: 1
keywords: wb97x-d3
keywords: def2-TZVPP
keywords: def2/J RIJCOSX GRIDX6 NOFINALGRIDX
keywords: grid4 nofinalgrid
keywords: scfconv7
keywords: smallprint printgap noloewdin
keywords: NOSOSCF
formula: C19H24ClN3O2
InChI: InChI=1S/C19H24ClN3O2/c1-18(2)13-25-19(3,23(18)17(24)22-12-11-21-14-22)10-4-5-15-6-8-16(20)9-7-15/h6-9,11-12,14H,4-5,10,13H2,1-3H3
49 atoms
Cl -5.335031 -0.628496 -0.458993
O  3.301722 1.227543 1.180477
O  2.320884 -2.178774 -1.463542
N  2.349445 -0.272755 -0.22976
N  0.60835 -1.865025 -0.019598
N  -0.82662 -3.308784 0.832341
C  2.181404 0.376329 1.105669
C  3.587298 0.207533 -0.884512
C  3.787499 1.501501 -0.104787
C  0.897173 1.200712 1.258536
C  2.300424 -0.613565 2.259042
C  4.782843 -0.720641 -0.652393
C  3.388359 0.495363 -2.365873
C  0.659638 2.28745 0.219573
C  1.829782 -1.458641 -0.630259
C  -0.656882 3.044798 0.435222
C  -1.870561 2.186263 0.22417
C  -0.636722 -1.283629 -0.112949
C  0.415849 -3.101082 0.529358
C  -2.554682 1.619587 1.293673
C  -2.307106 1.886753 -1.064281
C  -1.497644 -2.190345 0.423149
C  -3.625609 0.762689 1.093289
C  -3.375311 1.032807 -1.285366
C  -4.025577 0.467882 -0.199123
H  4.840531 1.776791 -0.027401
H  3.256133 2.334212 -0.58207
H  0.955244 1.667871 2.247033
H  0.043451 0.524384 1.303434
H  1.408756 -1.226612 2.369035
H  2.43632 -0.061366 3.18879
H  3.163326 -1.266576 2.128423
H  5.677978 -0.269202 -1.083412
H  4.643934 -1.691414 -1.118569
H  4.970368 -0.867435 0.411955
H  4.252826 1.040443 -2.749389
H  3.284867 -0.414356 -2.951537
H  2.505679 1.115771 -2.527952
H  1.468811 3.018816 0.259882
H  0.670692 1.860453 -0.788683
H  -0.686806 3.89533 -0.250327
H  -0.669287 3.46646 1.443803
H  -0.802792 -0.326377 -0.574929
H  1.234196 -3.785394 0.691584
H  -2.242115 1.84034 2.307111
H  -1.800591 2.324076 -1.917142
H  -2.567612 -2.100745 0.520562
H  -4.139172 0.321176 1.936155
H  -3.697254 0.80406 -2.291942
totalener: -1513.49087504 hartree
nucrepener: 2511.20761533 hartree
electener: -4024.69849037 hartree
oneelecener: -7059.08077499 hartree
twoeener: 3034.38228462 hartree
kineticenergy: 1508.19424527 hartree
xcener: -124.311986170626 hartree
chargesum: -0.0000000
charge: -0.077966 -0.329460 -0.362865 -0.125783 -0.028560 -0.291003 0.374735 0.162745 0.016696 -0.297578 -0.323914 -0.345431 -0.318332 -0.126015 0.312518 -0.137944 0.064148 -0.147299 0.033259 -0.147861 -0.230012 -0.056250 -0.131359 -0.084779 0.050757 0.096024 0.066599 0.095632 0.088176 0.110277 0.108767 0.102555 0.091000 0.122329 0.103680 0.098921 0.124189 0.086669 0.094165 0.073604 0.101373 0.088012 0.160667 0.136527 0.118327 0.115074 0.116638 0.123772 0.124579
qa: -0.0780 -0.3295 -0.3629 -0.1258 -0.0286 -0.2910 0.3747 0.1627 0.0167 -0.2976 -0.3239 -0.3454 -0.3183 -0.1260 0.3125 -0.1379 0.0641 -0.1473 0.0333 -0.1479 -0.2300 -0.0563 -0.1314 -0.0848 0.0508 0.0960 0.0666 0.0956 0.0882 0.1103 0.1088 0.1026 0.0910 0.1223 0.1037 0.0989 0.1242 0.0867 0.0942 0.0736 0.1014 0.0880 0.1607 0.1365 0.1183 0.1151 0.1166 0.1238 0.1246
va: 1.2243 2.0250 2.1339 3.0789 3.2756 3.1577 3.9863 3.9428 3.9929 3.8744 3.9699 3.9204 3.9108 3.8557 4.2753 3.8665 3.5114 3.8902 4.0478 3.9318 4.0017 4.0568 3.9711 3.9618 3.8998 0.9981 0.9846 1.0240 1.0054 0.9946 1.0138 1.0048 1.0047 1.0208 1.0047 1.0023 1.0148 1.0049 1.0128 1.0169 1.0061 1.0112 0.9908 1.0093 1.0064 1.0115 1.0249 1.0117 1.0108
dispcorr: -0.032824893 hartree
energy: -1513.523699932132
dipole: 33.80740 -32.68003 1.12737 14.33764 -12.17960 2.15804 1.97914 -1.87670 0.10244
magnitude: 2.43693 au
magnitude: 6.19418 debye
