program: Orca
programVersion: 4.2.1
elementType: Cl O O N N N C C C C C C C C C C C C C C C C C C C H H H H H H H H H H H H H H H H H H H H H H H H
charge: 0
multiplicity: 1
keywords: wb97x-d3
keywords: def2-TZVPP
keywords: def2/J RIJCOSX GRIDX6 NOFINALGRIDX
keywords: grid4 nofinalgrid
keywords: scfconv7
keywords: smallprint printgap noloewdin
keywords: NOSOSCF
formula: C19H24ClN3O2
InChI: InChI=1S/C19H24ClN3O2/c1-18(2)13-25-19(3,23(18)17(24)22-12-11-21-14-22)10-4-5-15-6-8-16(20)9-7-15/h6-9,11-12,14H,4-5,10,13H2,1-3H3
49 atoms
Cl -5.433604 3.293807 1.554157
O  1.975229 1.433133 0.567036
O  3.260095 -2.174618 -1.624798
N  2.634684 -0.613875 -0.098913
N  1.532451 -2.690332 -0.249931
N  -0.199097 -4.047864 -0.387762
C  1.606652 0.087384 0.729969
C  3.723153 0.321447 -0.464998
C  3.370564 1.482056 0.466313
C  0.1684 -0.049281 0.237933
C  1.698956 -0.285017 2.211232
C  5.101811 -0.238657 -0.145224
C  3.634423 0.785933 -1.919549
C  -0.068615 0.302417 -1.223395
C  2.552449 -1.807678 -0.719622
C  -1.514781 0.036139 -1.651641
C  -2.516622 0.83691 -0.867535
C  1.409058 -3.29063 0.97891
C  0.551357 -3.211517 -1.037919
C  -2.644836 2.207864 -1.074174
C  -3.314572 0.245449 0.105194
C  0.332841 -4.118042 0.867551
C  -3.536245 2.969015 -0.337252
C  -4.21313 0.990857 0.854167
C  -4.317344 2.352457 0.627879
H  3.857457 1.371113 1.445557
H  3.660638 2.449074 0.054394
H  -0.427421 0.617561 0.867715
H  -0.202318 -1.052775 0.453187
H  2.731049 -0.342287 2.557749
H  1.21919 -1.237401 2.419148
H  1.183576 0.474925 2.798532
H  5.848194 0.552318 -0.237656
H  5.384426 -1.039891 -0.823456
H  5.144123 -0.618581 0.876443
H  2.665348 1.238779 -2.131134
H  4.400808 1.540893 -2.103819
H  3.796942 -0.029492 -2.618255
H  0.179048 1.352608 -1.393592
H  0.589522 -0.274515 -1.878781
H  -1.732615 -1.030111 -1.544493
H  -1.615143 0.263917 -2.716012
H  2.108496 -3.120864 1.777796
H  0.437382 -2.92415 -2.071827
H  -2.038305 2.695279 -1.82865
H  -3.237265 -0.820386 0.284234
H  -0.077194 -4.771356 1.620965
H  -3.626304 4.032153 -0.51243
H  -4.827686 0.514958 1.605817
totalener: -1513.49348881 hartree
nucrepener: 2435.01954705 hartree
electener: -3948.51303586 hartree
oneelecener: -6906.71861202 hartree
twoeener: 2958.20557616 hartree
kineticenergy: 1508.19946498 hartree
xcener: -124.311020516299 hartree
chargesum: 0.0000000
charge: -0.085297 -0.322846 -0.358559 -0.056420 0.000467 -0.294198 0.211234 0.106112 0.070116 -0.139143 -0.327422 -0.309120 -0.344090 -0.168241 0.270490 -0.147464 0.031032 -0.159799 0.026106 -0.169205 -0.159755 -0.085323 -0.133223 -0.123931 0.084951 0.065244 0.093522 0.111286 0.090175 0.095736 0.106664 0.115456 0.099296 0.122149 0.085108 0.105276 0.093328 0.123883 0.095304 0.080005 0.096860 0.102426 0.163048 0.136415 0.112898 0.118802 0.129499 0.119601 0.121547
qa: -0.0853 -0.3228 -0.3586 -0.0564 0.0005 -0.2942 0.2112 0.1061 0.0701 -0.1391 -0.3274 -0.3091 -0.3441 -0.1682 0.2705 -0.1475 0.0310 -0.1598 0.0261 -0.1692 -0.1598 -0.0853 -0.1332 -0.1239 0.0850 0.0652 0.0935 0.1113 0.0902 0.0957 0.1067 0.1155 0.0993 0.1221 0.0851 0.1053 0.0933 0.1239 0.0953 0.0800 0.0969 0.1024 0.1630 0.1364 0.1129 0.1188 0.1295 0.1196 0.1215
va: 1.2210 2.0233 2.1393 3.0677 3.2374 3.1060 4.1476 3.9872 3.9247 3.6817 3.9267 3.9117 3.9172 3.8886 4.2974 3.8519 3.6200 3.9025 4.0378 4.0105 3.9546 4.0507 4.0257 4.0139 3.9209 1.0019 0.9948 1.0236 1.0057 1.0067 1.0095 1.0141 1.0024 1.0149 1.0077 1.0003 1.0064 1.0203 1.0213 1.0127 1.0172 1.0045 0.9927 1.0071 1.0099 1.0118 1.0102 1.0123 1.0116
dispcorr: -0.030279231 hartree
energy: -1513.523768038820
dipole: 31.44004 -30.13261 1.30743 -4.45512 5.43513 0.98001 -4.79946 5.37509 0.57563
magnitude: 1.73238 au
magnitude: 4.40335 debye
