program: Orca
programVersion: 4.2.1
elementType: Cl O O N N N C C C C C C C C C C C C C C C C C C C H H H H H H H H H H H H H H H H H H H H H H H H
charge: 0
multiplicity: 1
keywords: wb97x-d3
keywords: def2-TZVPP
keywords: def2/J RIJCOSX GRIDX6 NOFINALGRIDX
keywords: grid4 nofinalgrid
keywords: scfconv7
keywords: smallprint printgap noloewdin
keywords: NOSOSCF
formula: C19H24ClN3O2
InChI: InChI=1S/C19H24ClN3O2/c1-18(2)13-25-19(3,23(18)17(24)22-12-11-21-14-22)10-4-5-15-6-8-16(20)9-7-15/h6-9,11-12,14H,4-5,10,13H2,1-3H3
49 atoms
Cl -3.779225 2.91696 -3.272739
O  1.789309 1.264292 0.380772
O  2.431525 -2.845599 -1.050061
N  1.642145 -0.910494 -0.163706
N  1.731228 -2.893834 1.106351
N  2.185557 -4.193162 2.828655
C  1.443291 0.038837 0.972637
C  1.754869 -0.162171 -1.437846
C  1.342175 1.227542 -0.947879
C  -0.029379 0.068226 1.413246
C  2.391487 -0.16802 2.140974
C  3.193306 -0.110268 -1.955683
C  0.794663 -0.678459 -2.499631
C  -0.400291 1.275423 2.270477
C  1.969181 -2.217656 -0.130185
C  -1.912083 1.531493 2.2825
C  -2.43152 1.888786 0.916954
C  0.52869 -3.186528 1.703013
C  2.687128 -3.555609 1.815537
C  -2.091982 3.105971 0.330462
C  -3.209111 1.005252 0.176711
C  0.8387 -3.982448 2.763748
C  -2.503118 3.431115 -0.951068
C  -3.629066 1.310989 -1.109925
C  -3.268969 2.524966 -1.669061
H  1.833544 2.025656 -1.504654
H  0.256614 1.380699 -1.021834
H  -0.254058 -0.841329 1.969488
H  -0.66016 0.040895 0.52059
H  2.099254 -1.001507 2.775092
H  2.38505 0.730213 2.758435
H  3.413688 -0.32331 1.796392
H  3.86377 0.308582 -1.204389
H  3.236599 0.533228 -2.836101
H  3.5608 -1.090906 -2.242641
H  1.094155 -1.651644 -2.881683
H  -0.220293 -0.754854 -2.1069
H  0.770972 0.016067 -3.341205
H  -0.056651 1.129182 3.2976
H  0.104819 2.17024 1.902164
H  -2.129062 2.341218 2.983741
H  -2.437684 0.650677 2.660645
H  -0.412373 -2.859958 1.297569
H  3.730601 -3.511849 1.544414
H  -1.491067 3.818308 0.883646
H  -3.49487 0.053718 0.60916
H  0.160926 -4.426718 3.475004
H  -2.232989 4.382096 -1.389232
H  -4.231985 0.610215 -1.670821
totalener: -1513.49204012 hartree
nucrepener: 2456.43934870 hartree
electener: -3969.93138882 hartree
oneelecener: -6949.31778123 hartree
twoeener: 2979.38639241 hartree
kineticenergy: 1508.19735287 hartree
xcener: -124.309711403356 hartree
chargesum: -0.0000000
charge: -0.079008 -0.335102 -0.365460 -0.094183 -0.030258 -0.294418 0.375835 0.112207 0.066634 -0.295350 -0.321794 -0.335397 -0.310404 -0.157288 0.321294 -0.119362 0.074650 -0.159499 0.044171 -0.218975 -0.175910 -0.084066 -0.114138 -0.126192 0.079645 0.097092 0.052097 0.101634 0.073186 0.108218 0.112523 0.106848 0.102549 0.089226 0.121229 0.121914 0.085670 0.100612 0.089127 0.094459 0.102153 0.079605 0.159720 0.135544 0.115182 0.117796 0.128402 0.123834 0.123751
qa: -0.0790 -0.3351 -0.3655 -0.0942 -0.0303 -0.2944 0.3758 0.1122 0.0666 -0.2953 -0.3218 -0.3354 -0.3104 -0.1573 0.3213 -0.1194 0.0746 -0.1595 0.0442 -0.2190 -0.1759 -0.0841 -0.1141 -0.1262 0.0796 0.0971 0.0521 0.1016 0.0732 0.1082 0.1125 0.1068 0.1025 0.0892 0.1212 0.1219 0.0857 0.1006 0.0891 0.0945 0.1022 0.0796 0.1597 0.1355 0.1152 0.1178 0.1284 0.1238 0.1238
va: 1.2277 2.0169 2.1365 3.1027 3.2762 3.1320 3.9586 4.0026 3.9521 3.8962 3.9606 3.9175 3.9145 3.8491 4.2722 3.8742 3.5981 3.9065 4.0503 3.9892 3.9416 4.0538 3.9791 3.9942 3.9256 0.9968 0.9969 1.0325 1.0189 0.9925 1.0097 1.0107 1.0079 1.0043 1.0226 1.0143 1.0051 1.0035 1.0095 1.0308 1.0048 1.0131 0.9931 1.0097 1.0117 1.0094 1.0106 1.0108 1.0106
dispcorr: -0.030345537 hartree
energy: -1513.522385654687
dipole: 14.09449 -14.78435 -0.68986 -1.07410 2.61289 1.53879 11.72577 -11.57359 0.15218
magnitude: 1.69321 au
magnitude: 4.30379 debye
