program: Orca
programVersion: 4.2.1
elementType: Cl O O N N N C C C C C C C C C C C C C C C C C C C H H H H H H H H H H H H H H H H H H H H H H H H
charge: 0
multiplicity: 1
keywords: wb97x-d3
keywords: def2-TZVPP
keywords: def2/J RIJCOSX GRIDX6 NOFINALGRIDX
keywords: grid4 nofinalgrid
keywords: scfconv7
keywords: smallprint printgap noloewdin
keywords: NOSOSCF
formula: C19H24ClN3O2
InChI: InChI=1S/C19H24ClN3O2/c1-18(2)13-25-19(3,23(18)17(24)22-12-11-21-14-22)10-4-5-15-6-8-16(20)9-7-15/h6-9,11-12,14H,4-5,10,13H2,1-3H3
49 atoms
Cl -5.26917 -0.697938 -0.302067
O  3.094777 1.364624 0.911668
O  2.743813 -2.541129 -1.10661
N  2.496506 -0.423178 -0.331456
N  0.746265 -2.00141 -0.177272
N  -0.854385 -3.186851 0.770779
C  1.977048 0.542374 0.686474
C  3.829092 0.00893 -0.807835
C  3.812127 1.445093 -0.287891
C  0.815998 1.368128 0.124209
C  1.62954 -0.109031 2.017015
C  4.966708 -0.766499 -0.140386
C  3.947264 -0.022658 -2.324573
C  0.410693 2.564429 0.975157
C  2.079635 -1.684339 -0.578198
C  -0.809618 3.284041 0.386136
C  -1.981525 2.358598 0.205399
C  -0.445831 -1.512759 -0.662881
C  0.428309 -3.0307 0.658882
C  -2.632925 1.815086 1.309555
C  -2.398054 1.957462 -1.059059
C  -1.41279 -2.254507 -0.056641
C  -3.648513 0.885515 1.164044
C  -3.415887 1.029933 -1.226553
C  -4.030168 0.492191 -0.108995
H  4.811988 1.825186 -0.076721
H  3.33488 2.123571 -1.00944
H  -0.046596 0.713495 0.026192
H  1.059823 1.705868 -0.889056
H  0.653074 -0.588166 2.00134
H  1.610707 0.65315 2.795037
H  2.382229 -0.844943 2.299267
H  4.959024 -1.816394 -0.419151
H  4.907868 -0.69338 0.946097
H  5.924909 -0.345637 -0.449986
H  3.099729 0.47785 -2.794899
H  4.855494 0.500105 -2.630306
H  4.006031 -1.037753 -2.709036
H  0.169403 2.238181 1.990375
H  1.23664 3.271882 1.067822
H  -0.541935 3.726631 -0.576994
H  -1.083157 4.116243 1.039737
H  -0.498262 -0.740224 -1.409178
H  1.18695 -3.609125 1.163065
H  -2.336101 2.112271 2.308596
H  -1.914564 2.369934 -1.936804
H  -2.480738 -2.170616 -0.182043
H  -4.135589 0.464031 2.032394
H  -3.72457 0.725834 -2.217386
totalener: -1513.49159090 hartree
nucrepener: 2492.38454289 hartree
electener: -4005.87613379 hartree
oneelecener: -7021.56063961 hartree
twoeener: 3015.68450582 hartree
kineticenergy: 1508.19737387 hartree
xcener: -124.310506178327 hartree
chargesum: 0.0000000
charge: -0.083747 -0.334702 -0.365099 -0.098408 -0.025973 -0.292739 0.359511 0.124988 0.045676 -0.191604 -0.342649 -0.342070 -0.307223 -0.150857 0.312877 -0.136517 0.081963 -0.129013 0.037007 -0.180663 -0.167532 -0.084329 -0.098257 -0.138417 0.057266 0.096922 0.066863 0.006429 0.086418 0.112648 0.110520 0.105531 0.121251 0.102711 0.089242 0.084287 0.097472 0.122581 0.078010 0.090211 0.080451 0.102773 0.163434 0.134342 0.112086 0.112113 0.128006 0.122182 0.124031
qa: -0.0837 -0.3347 -0.3651 -0.0984 -0.0260 -0.2927 0.3595 0.1250 0.0457 -0.1916 -0.3426 -0.3421 -0.3072 -0.1509 0.3129 -0.1365 0.0820 -0.1290 0.0370 -0.1807 -0.1675 -0.0843 -0.0983 -0.1384 0.0573 0.0969 0.0669 0.0064 0.0864 0.1126 0.1105 0.1055 0.1213 0.1027 0.0892 0.0843 0.0975 0.1226 0.0780 0.0902 0.0805 0.1028 0.1634 0.1343 0.1121 0.1121 0.1280 0.1222 0.1240
va: 1.2168 2.0077 2.1347 3.0771 3.2810 3.1412 3.9691 3.9906 3.9650 3.8675 3.9621 3.9201 3.9051 3.8842 4.2792 3.8608 3.5695 3.8738 4.0495 4.0039 3.9355 4.0587 3.9792 3.9888 3.9038 0.9944 0.9974 1.0968 1.0145 0.9942 1.0107 1.0088 1.0206 1.0075 1.0052 1.0089 1.0028 1.0153 1.0069 1.0325 1.0125 1.0063 0.9929 1.0100 1.0096 1.0106 1.0225 1.0115 1.0117
dispcorr: -0.031888638 hartree
energy: -1513.523479533415
dipole: 32.60774 -31.51280 1.09493 15.49868 -13.25565 2.24303 1.13105 -1.27162 -0.14057
magnitude: 2.49996 au
magnitude: 6.35440 debye
