program: Orca
programVersion: 4.2.1
elementType: Cl O O N N N C C C C C C C C C C C C C C C C C C C H H H H H H H H H H H H H H H H H H H H H H H H
charge: 0
multiplicity: 1
keywords: wb97x-d3
keywords: def2-TZVPP
keywords: def2/J RIJCOSX GRIDX6 NOFINALGRIDX
keywords: grid4 nofinalgrid
keywords: scfconv7
keywords: smallprint printgap noloewdin
keywords: NOSOSCF
formula: C19H24ClN3O2
InChI: InChI=1S/C19H24ClN3O2/c1-18(2)13-25-19(3,23(18)17(24)22-12-11-21-14-22)10-4-5-15-6-8-16(20)9-7-15/h6-9,11-12,14H,4-5,10,13H2,1-3H3
49 atoms
Cl -5.13319 -0.994951 1.434187
O  3.027177 1.583524 0.639095
O  2.581459 -1.910688 -1.988567
N  2.607764 -0.441211 -0.259076
N  0.646635 -1.620147 -0.857753
N  -1.452177 -1.999428 -1.419597
C  1.977482 0.655988 0.544429
C  4.067677 -0.213419 -0.365785
C  4.222832 0.858084 0.712077
C  0.819403 1.335532 -0.178465
C  1.580041 0.192444 1.951879
C  4.876021 -1.457142 -0.025528
C  4.477071 0.36733 -1.720964
C  0.362551 2.638049 0.474149
C  2.023812 -1.337069 -1.084714
C  -0.99439 3.104162 -0.070215
C  -2.096945 2.140697 0.271908
C  0.010921 -2.067957 0.277288
C  -0.287345 -1.627745 -1.851884
C  -2.582043 1.23189 -0.660804
C  -2.60158 2.077625 1.568979
C  -1.278772 -2.289444 -0.095526
C  -3.522032 0.271864 -0.318919
C  -3.54482 1.130679 1.929944
C  -3.992527 0.224326 0.980432
H  4.37306 0.410839 1.704916
H  5.0578 1.530479 0.514183
H  -0.024498 0.648143 -0.209017
H  1.113052 1.533005 -1.214032
H  2.261617 -0.564441 2.340271
H  0.571697 -0.214084 1.973032
H  1.602799 1.041397 2.633991
H  4.806224 -2.214818 -0.802189
H  4.543828 -1.894863 0.91677
H  5.928848 -1.190497 0.083095
H  3.932072 1.287186 -1.936043
H  5.541297 0.60923 -1.702705
H  4.309092 -0.334181 -2.532602
H  0.270662 2.514826 1.55639
H  1.107662 3.419148 0.315728
H  -0.933417 3.232693 -1.154208
H  -1.219165 4.090534 0.342973
H  0.529384 -2.238852 1.202875
H  -0.044816 -1.33568 -2.861634
H  -2.205884 1.251005 -1.676432
H  -2.248911 2.778167 2.317362
H  -2.091853 -2.64261 0.518637
H  -3.851399 -0.449718 -1.052639
H  -3.925481 1.09202 2.941381
totalener: -1513.49163363 hartree
nucrepener: 2503.46873564 hartree
electener: -4016.96036927 hartree
oneelecener: -7044.11811779 hartree
twoeener: 3027.15774851 hartree
kineticenergy: 1508.19958393 hartree
xcener: -124.312199488875 hartree
chargesum: 0.0000000
charge: -0.090121 -0.318265 -0.373207 -0.076042 -0.024603 -0.318216 0.227304 0.114625 0.068066 -0.114551 -0.368737 -0.307866 -0.344799 -0.164083 0.334373 -0.122577 0.082444 -0.160315 0.039227 -0.149078 -0.217304 -0.050740 -0.131474 -0.119004 0.082869 0.065831 0.094086 0.035943 0.096755 0.100844 0.117040 0.114998 0.121827 0.085407 0.098405 0.101650 0.089244 0.121950 0.079594 0.090243 0.082365 0.098947 0.164347 0.134949 0.117435 0.113051 0.128094 0.129967 0.119100
qa: -0.0901 -0.3183 -0.3732 -0.0760 -0.0246 -0.3182 0.2273 0.1146 0.0681 -0.1146 -0.3687 -0.3079 -0.3448 -0.1641 0.3344 -0.1226 0.0824 -0.1603 0.0392 -0.1491 -0.2173 -0.0507 -0.1315 -0.1190 0.0829 0.0658 0.0941 0.0359 0.0968 0.1008 0.1170 0.1150 0.1218 0.0854 0.0984 0.1016 0.0892 0.1219 0.0796 0.0902 0.0824 0.0989 0.1643 0.1349 0.1174 0.1131 0.1281 0.1300 0.1191
va: 1.2158 2.0170 2.1283 3.0647 3.2649 3.0719 4.0644 4.0062 3.9330 3.8198 3.9279 3.9058 3.9157 3.9201 4.2620 3.8622 3.5688 3.8907 4.0355 3.9055 4.0158 3.9867 3.9408 4.0184 3.8908 1.0001 0.9940 1.0395 1.0135 1.0066 1.0034 1.0125 1.0142 1.0083 1.0023 1.0081 1.0046 1.0215 1.0062 1.0284 1.0123 1.0063 0.9935 1.0118 1.0115 1.0093 1.0132 1.0261 1.0127
dispcorr: -0.032193756 hartree
energy: -1513.523827390598
dipole: 34.28263 -32.60766 1.67497 12.78696 -11.59071 1.19624 0.47172 0.58990 1.06162
magnitude: 2.31594 au
magnitude: 5.88664 debye
