program: Orca
programVersion: 4.2.1
elementType: Cl O O N N N C C C C C C C C C C C C C C C C C C C H H H H H H H H H H H H H H H H H H H H H H H H
charge: 0
multiplicity: 1
keywords: wb97x-d3
keywords: def2-TZVPP
keywords: def2/J RIJCOSX GRIDX6 NOFINALGRIDX
keywords: grid4 nofinalgrid
keywords: scfconv7
keywords: smallprint printgap noloewdin
keywords: NOSOSCF
formula: C19H24ClN3O2
InChI: InChI=1S/C19H24ClN3O2/c1-18(2)13-25-19(3,23(18)17(24)22-12-11-21-14-22)10-4-5-15-6-8-16(20)9-7-15/h6-9,11-12,14H,4-5,10,13H2,1-3H3
49 atoms
Cl -5.217363 -0.676836 -0.486744
O  3.132226 1.332545 0.919593
O  2.638231 -2.493241 -1.231023
N  2.459198 -0.414782 -0.34036
N  0.723951 -2.000114 -0.114165
N  -0.793342 -3.213525 0.930593
C  2.001501 0.517725 0.734438
C  3.749533 0.044683 -0.898904
C  3.772682 1.458673 -0.319334
C  0.8127 1.35549 0.257515
C  1.729507 -0.170434 2.063674
C  4.935031 -0.753821 -0.353822
C  3.750628 0.077308 -2.420229
C  0.406198 2.486604 1.192195
C  2.021464 -1.663193 -0.610596
C  -0.805394 3.255035 0.647506
C  -1.967674 2.345215 0.358574
C  -0.504382 -1.528249 -0.519041
C  0.477028 -3.035808 0.737308
C  -2.336667 2.036638 -0.946091
C  -2.653002 1.718666 1.396004
C  -1.418543 -2.287182 0.145181
C  -3.341753 1.119851 -1.217589
C  -3.656985 0.798689 1.146359
C  -3.991602 0.499143 -0.164792
H  4.785952 1.826883 -0.156831
H  3.255566 2.168734 -0.980205
H  -0.040013 0.692253 0.136884
H  1.026448 1.760755 -0.737675
H  1.764967 0.569606 2.862113
H  2.491655 -0.919231 2.278635
H  0.750143 -0.642576 2.094212
H  4.964964 -0.717162 0.735724
H  5.866157 -0.323349 -0.72638
H  4.900888 -1.793596 -0.666647
H  3.771299 -0.920641 -2.850971
H  2.872645 0.600544 -2.801525
H  4.636162 0.609186 -2.772995
H  0.152156 2.084872 2.176793
H  1.234599 3.18082 1.346159
H  -0.520546 3.785049 -0.265175
H  -1.096549 4.022076 1.369441
H  -0.619251 -0.752453 -1.255266
H  1.275349 -3.604105 1.189311
H  -1.823826 2.51313 -1.773227
H  -2.392489 1.941428 2.424055
H  -2.493452 -2.220894 0.086538
H  -3.613304 0.888227 -2.238444
H  -4.171463 0.312237 1.963452
totalener: -1513.49161973 hartree
nucrepener: 2495.56664513 hartree
electener: -4009.05826485 hartree
oneelecener: -7027.89203579 hartree
twoeener: 3018.83377094 hartree
kineticenergy: 1508.19892261 hartree
xcener: -124.311066436277 hartree
chargesum: 0.0000000
charge: -0.083731 -0.332801 -0.364213 -0.095820 -0.024599 -0.293615 0.359368 0.121579 0.047130 -0.185880 -0.348032 -0.340244 -0.307873 -0.149540 0.311463 -0.141571 0.075251 -0.127868 0.036163 -0.158723 -0.162031 -0.082501 -0.149614 -0.117095 0.069095 0.097600 0.065907 0.000101 0.084814 0.111634 0.105636 0.113000 0.102468 0.089263 0.121090 0.122585 0.084152 0.097762 0.079111 0.091492 0.081927 0.102206 0.164295 0.133614 0.111287 0.112615 0.126438 0.124620 0.122085
qa: -0.0837 -0.3328 -0.3642 -0.0958 -0.0246 -0.2936 0.3594 0.1216 0.0471 -0.1859 -0.3480 -0.3402 -0.3079 -0.1495 0.3115 -0.1416 0.0753 -0.1279 0.0362 -0.1587 -0.1620 -0.0825 -0.1496 -0.1171 0.0691 0.0976 0.0659 0.0001 0.0848 0.1116 0.1056 0.1130 0.1025 0.0893 0.1211 0.1226 0.0842 0.0978 0.0791 0.0915 0.0819 0.1022 0.1643 0.1336 0.1113 0.1126 0.1264 0.1246 0.1221
va: 1.2169 2.0142 2.1354 3.0787 3.2818 3.1427 3.9785 3.9912 3.9599 3.8667 3.9620 3.9201 3.9065 3.8738 4.2816 3.8628 3.5771 3.8776 4.0498 3.9352 3.9832 4.0590 4.0064 3.9850 3.8858 0.9940 0.9979 1.1005 1.0154 1.0101 1.0094 0.9933 1.0075 1.0050 1.0207 1.0158 1.0084 1.0027 1.0052 1.0330 1.0124 1.0070 0.9931 1.0098 1.0106 1.0091 1.0229 1.0116 1.0123
dispcorr: -0.031986319 hartree
energy: -1513.523606045483
dipole: 32.18779 -31.11882 1.06898 15.39139 -13.14264 2.24875 1.96332 -2.05024 -0.08693
magnitude: 2.49141 au
magnitude: 6.33267 debye
