program: Orca
programVersion: 4.2.1
elementType: Cl O O N N N C C C C C C C C C C C C C C C C C C C H H H H H H H H H H H H H H H H H H H H H H H H
charge: 0
multiplicity: 1
keywords: wb97x-d3
keywords: def2-TZVPP
keywords: def2/J RIJCOSX GRIDX6 NOFINALGRIDX
keywords: grid4 nofinalgrid
keywords: scfconv7
keywords: smallprint printgap noloewdin
keywords: NOSOSCF
formula: C19H24ClN3O2
InChI: InChI=1S/C19H24ClN3O2/c1-18(2)13-25-19(3,23(18)17(24)22-12-11-21-14-22)10-4-5-15-6-8-16(20)9-7-15/h6-9,11-12,14H,4-5,10,13H2,1-3H3
49 atoms
Cl -4.440325 1.374616 -2.635647
O  1.63621 1.405403 -0.640236
O  1.899974 -1.278624 2.475221
N  1.697131 -0.634436 0.306566
N  1.826657 -2.907977 0.901026
N  1.272906 -5.041552 0.946384
C  1.798607 0.81977 0.625002
C  1.163928 -0.821541 -1.067115
C  0.711776 0.619538 -1.33784
C  0.666171 1.265231 1.566529
C  3.17336 1.203101 1.138455
C  2.248766 -1.199388 -2.074608
C  -0.025938 -1.767363 -1.160992
C  0.491218 2.782562 1.64467
C  1.809978 -1.538246 1.299808
C  -0.961706 3.180908 1.936201
C  -1.884838 2.765805 0.824053
C  2.763039 -3.570646 0.144897
C  0.972748 -3.855607 1.379133
C  -1.829955 3.403656 -0.413136
C  -2.764368 1.697708 0.965703
C  2.395483 -4.881138 0.186433
C  -2.612955 2.988229 -1.476864
C  -3.554094 1.262728 -0.089153
C  -3.469443 1.910505 -1.309555
H  0.757849 0.8753 -2.396984
H  -0.318382 0.786664 -0.993755
H  0.839636 0.858681 2.560895
H  -0.262931 0.807638 1.21633
H  3.358266 0.784423 2.124501
H  3.250592 2.288207 1.211905
H  3.948711 0.856454 0.455411
H  2.597996 -2.219285 -1.937283
H  3.100914 -0.522608 -2.011081
H  1.845366 -1.136636 -3.086484
H  0.256126 -2.81734 -1.117201
H  -0.759925 -1.566547 -0.379402
H  -0.523609 -1.610655 -2.119864
H  1.134896 3.198297 2.423636
H  0.79793 3.254232 0.70911
H  -1.014231 4.26353 2.076849
H  -1.288888 2.732479 2.877766
H  3.61187 -3.072911 -0.288696
H  0.144917 -3.603726 2.023567
H  -1.157016 4.241169 -0.554519
H  -2.834623 1.186231 1.918359
H  2.888806 -5.718896 -0.279862
H  -2.558601 3.496771 -2.429626
H  -4.229447 0.428083 0.039759
totalener: -1513.49211345 hartree
nucrepener: 2469.98955578 hartree
electener: -3983.48166924 hartree
oneelecener: -6976.63421076 hartree
twoeener: 2993.15254152 hartree
kineticenergy: 1508.19483339 hartree
xcener: -124.310794555711 hartree
chargesum: -0.0000000
charge: -0.080568 -0.344036 -0.372121 -0.099379 -0.028371 -0.293840 0.360299 0.086777 0.114307 -0.252570 -0.291850 -0.341250 -0.328799 -0.163028 0.323556 -0.133114 0.083160 -0.156451 0.041680 -0.192840 -0.187827 -0.086987 -0.128004 -0.126185 0.082079 0.095597 0.022200 0.126714 0.053859 0.111083 0.102372 0.092666 0.104471 0.116866 0.093598 0.117018 0.098172 0.110001 0.089028 0.088782 0.098953 0.083313 0.164538 0.133777 0.113600 0.123287 0.128268 0.122667 0.124531
qa: -0.0806 -0.3440 -0.3721 -0.0994 -0.0284 -0.2938 0.3603 0.0868 0.1143 -0.2526 -0.2918 -0.3412 -0.3288 -0.1630 0.3236 -0.1331 0.0832 -0.1565 0.0417 -0.1928 -0.1878 -0.0870 -0.1280 -0.1262 0.0821 0.0956 0.0222 0.1267 0.0539 0.1111 0.1024 0.0927 0.1045 0.1169 0.0936 0.1170 0.0982 0.1100 0.0890 0.0888 0.0990 0.0833 0.1645 0.1338 0.1136 0.1233 0.1283 0.1227 0.1245
va: 1.2265 2.0154 2.1301 3.1335 3.2617 3.1315 4.0828 3.9865 3.9446 3.8526 3.9171 3.9276 3.9501 3.8394 4.2719 3.8921 3.6134 3.9097 4.0559 3.9714 3.9356 4.0626 3.9855 3.9790 3.9050 0.9956 1.0164 1.0383 1.0175 1.0153 1.0039 1.0154 1.0138 1.0055 1.0089 0.9970 1.0027 1.0074 1.0088 1.0293 1.0056 1.0101 0.9901 1.0105 1.0112 1.0074 1.0107 1.0115 1.0104
dispcorr: -0.030911239 hartree
energy: -1513.523024689958
dipole: 19.18662 -18.92432 0.26229 4.61786 -3.16008 1.45778 5.40230 -6.11341 -0.71111
magnitude: 1.64304 au
magnitude: 4.17629 debye
