program: Orca
programVersion: 4.2.1
elementType: Cl O O N N N C C C C C C C C C C C C C C C C C C C H H H H H H H H H H H H H H H H H H H H H H H H
charge: 0
multiplicity: 1
keywords: wb97x-d3
keywords: def2-TZVPP
keywords: def2/J RIJCOSX GRIDX6 NOFINALGRIDX
keywords: grid4 nofinalgrid
keywords: scfconv7
keywords: smallprint printgap noloewdin
keywords: NOSOSCF
formula: C19H24ClN3O2
InChI: InChI=1S/C19H24ClN3O2/c1-18(2)13-25-19(3,23(18)17(24)22-12-11-21-14-22)10-4-5-15-6-8-16(20)9-7-15/h6-9,11-12,14H,4-5,10,13H2,1-3H3
49 atoms
Cl -3.523112 2.871434 -3.287976
O  1.459776 1.310551 0.285275
O  2.581825 -2.718208 -1.066679
N  1.565039 -0.884633 -0.190372
N  1.929785 -2.8124 1.106214
N  1.005679 -4.002426 2.71752
C  1.349737 0.072339 0.938346
C  1.498639 -0.16888 -1.485707
C  0.918902 1.160183 -1.000545
C  -0.056993 -0.076939 1.539414
C  2.435704 0.035043 1.999217
C  2.880933 0.070486 -2.095655
C  0.56108 -0.849043 -2.472173
C  -0.496652 1.10829 2.402046
C  2.065827 -2.136046 -0.14573
C  -2.011808 1.340986 2.336766
C  -2.452796 1.735856 0.95397
C  2.959568 -3.40073 1.798004
C  0.77547 -3.237725 1.695026
C  -2.114074 2.983879 0.436214
C  -3.14538 0.856157 0.129138
C  2.365561 -4.10309 2.800659
C  -2.442819 3.34267 -0.85985
C  -3.479638 1.194337 -1.174711
C  -3.120941 2.438575 -1.663747
H  1.238119 2.002205 -1.614846
H  -0.179404 1.147362 -0.987672
H  -0.10165 -0.985355 2.138629
H  -0.763137 -0.221945 0.717729
H  3.426941 0.046707 1.545796
H  2.354442 -0.833451 2.647877
H  2.347298 0.922874 2.625649
H  3.369132 -0.856603 -2.380815
H  3.528048 0.6070 -1.400786
H  2.776601 0.683551 -2.992536
H  -0.409789 -1.047638 -2.015969
H  0.395747 -0.193957 -3.329201
H  0.968959 -1.785718 -2.845589
H  -0.205146 0.946327 3.442333
H  0.006036 2.021882 2.08029
H  -2.283172 2.123381 3.049907
H  -2.542887 0.439773 2.653918
H  3.989896 -3.254805 1.523854
H  -0.195899 -2.986318 1.299373
H  -1.576818 3.692955 1.054888
H  -3.431159 -0.11815 0.507798
H  2.843439 -4.679627 3.576218
H  -2.174075 4.316946 -1.244397
H  -4.016003 0.495738 -1.80204
totalener: -1513.49178783 hartree
nucrepener: 2477.46116680 hartree
electener: -3990.95295463 hartree
oneelecener: -6991.50001468 hartree
twoeener: 3000.54706005 hartree
kineticenergy: 1508.19565690 hartree
xcener: -124.309858499791 hartree
chargesum: 0.0000000
charge: -0.078888 -0.338526 -0.362604 -0.093155 -0.034899 -0.297150 0.377620 0.100250 0.105903 -0.314329 -0.314737 -0.338530 -0.302481 -0.167288 0.320201 -0.130079 0.088747 -0.128057 0.008311 -0.195057 -0.194152 -0.075484 -0.124401 -0.120216 0.078910 0.098592 0.015598 0.126834 0.074365 0.106294 0.108496 0.110674 0.121629 0.101405 0.090060 0.081847 0.101212 0.122360 0.093143 0.089610 0.100235 0.084114 0.145748 0.145964 0.113354 0.122666 0.128847 0.123070 0.123971
qa: -0.0789 -0.3385 -0.3626 -0.0932 -0.0349 -0.2971 0.3776 0.1003 0.1059 -0.3143 -0.3147 -0.3385 -0.3025 -0.1673 0.3202 -0.1301 0.0887 -0.1281 0.0083 -0.1951 -0.1942 -0.0755 -0.1244 -0.1202 0.0789 0.0986 0.0156 0.1268 0.0744 0.1063 0.1085 0.1107 0.1216 0.1014 0.0901 0.0818 0.1012 0.1224 0.0931 0.0896 0.1002 0.0841 0.1457 0.1460 0.1134 0.1227 0.1288 0.1231 0.1240
va: 1.2278 2.0061 2.1388 3.1107 3.2741 3.1241 3.9768 4.0421 3.9587 3.8839 3.9571 3.9178 3.9058 3.8604 4.2702 3.8903 3.6012 3.9159 4.0512 3.9749 3.9384 4.0194 3.9811 3.9794 3.9074 0.9969 1.0158 1.0189 1.0176 1.0099 0.9926 1.0096 1.0224 1.0080 1.0042 1.0075 1.0042 1.0141 1.0079 1.0311 1.0054 1.0120 1.0104 0.9962 1.0113 1.0077 1.0087 1.0116 1.0109
dispcorr: -0.031250664 hartree
energy: -1513.523038496669
dipole: 13.94561 -13.99274 -0.04712 -1.72597 3.10914 1.38317 11.94062 -11.67622 0.26439
magnitude: 1.40900 au
magnitude: 3.58139 debye
