program: Orca
programVersion: 4.2.1
elementType: Cl O O N N N C C C C C C C C C C C C C C C C C C C H H H H H H H H H H H H H H H H H H H H H H H H
charge: 0
multiplicity: 1
keywords: wb97x-d3
keywords: def2-TZVPP
keywords: def2/J RIJCOSX GRIDX6 NOFINALGRIDX
keywords: grid4 nofinalgrid
keywords: scfconv7
keywords: smallprint printgap noloewdin
keywords: NOSOSCF
formula: C19H24ClN3O2
InChI: InChI=1S/C19H24ClN3O2/c1-18(2)13-25-19(3,23(18)17(24)22-12-11-21-14-22)10-4-5-15-6-8-16(20)9-7-15/h6-9,11-12,14H,4-5,10,13H2,1-3H3
49 atoms
Cl -6.059301 1.791879 -1.952509
O  3.085418 1.530908 -0.209154
O  1.265197 -1.201786 2.280238
N  2.319791 -0.514913 0.392743
N  1.630036 -2.750141 0.663859
N  0.653004 -4.644812 0.102973
C  2.600046 0.84755 0.922385
C  2.650808 -0.595066 -1.048037
C  2.621078 0.900803 -1.367767
C  1.371748 1.571028 1.495562
C  3.715783 0.812525 1.957334
C  4.057067 -1.139587 -1.295769
C  1.622121 -1.319912 -1.905718
C  0.099217 1.542271 0.659974
C  1.724584 -1.425485 1.187152
C  -1.089167 2.13146 1.423246
C  -2.352683 2.070161 0.614484
C  2.637313 -3.656518 0.437813
C  0.457895 -3.415836 0.470647
C  -2.735009 3.12484 -0.20727
C  -3.146203 0.926936 0.623386
C  2.007166 -4.812281 0.088127
C  -3.870584 3.049104 -0.998442
C  -4.284615 0.831393 -0.160342
C  -4.639838 1.897594 -0.970861
H  3.283691 1.1556 -2.196655
H  1.605612 1.216855 -1.637707
H  1.682243 2.610719 1.638579
H  1.158273 1.176164 2.487373
H  4.604064 0.326717 1.554583
H  3.402482 0.282399 2.854273
H  3.986971 1.828563 2.244574
H  4.309729 -1.03837 -2.352271
H  4.135249 -2.19587 -1.0528
H  4.805418 -0.59262 -0.722738
H  1.702101 -2.403398 -1.854761
H  0.604323 -1.02828 -1.644174
H  1.782611 -1.039237 -2.948489
H  0.230896 2.104833 -0.267422
H  -0.154137 0.51923 0.368702
H  -0.870268 3.166536 1.699665
H  -1.219729 1.582558 2.359675
H  3.674612 -3.421927 0.596966
H  -0.499085 -2.934548 0.600431
H  -2.138237 4.029058 -0.229916
H  -2.874084 0.093376 1.260451
H  2.457988 -5.760552 -0.156826
H  -4.157141 3.87972 -1.628582
H  -4.893041 -0.062202 -0.138273
totalener: -1513.49218442 hartree
nucrepener: 2395.86863475 hartree
electener: -3909.36081917 hartree
oneelecener: -6828.28907384 hartree
twoeener: 2918.92825467 hartree
kineticenergy: 1508.20044233 hartree
xcener: -124.309468979087 hartree
chargesum: 0.0000000
charge: -0.084570 -0.331707 -0.360576 -0.092661 -0.011374 -0.292093 0.355953 0.118193 0.030206 -0.255587 -0.299382 -0.334867 -0.327238 -0.124185 0.271416 -0.104575 0.069260 -0.155120 0.047348 -0.193030 -0.208635 -0.090616 -0.123700 -0.120562 0.075965 0.094154 0.070569 0.093311 0.096462 0.090041 0.106355 0.103824 0.096211 0.102242 0.116560 0.117374 0.103064 0.109957 0.097735 0.067013 0.083548 0.095344 0.159771 0.131621 0.113862 0.121199 0.129353 0.120178 0.122391
qa: -0.0846 -0.3317 -0.3606 -0.0927 -0.0114 -0.2921 0.3560 0.1182 0.0302 -0.2556 -0.2994 -0.3349 -0.3272 -0.1242 0.2714 -0.1046 0.0693 -0.1551 0.0473 -0.1930 -0.2086 -0.0906 -0.1237 -0.1206 0.0760 0.0942 0.0706 0.0933 0.0965 0.0900 0.1064 0.1038 0.0962 0.1022 0.1166 0.1174 0.1031 0.1100 0.0977 0.0670 0.0835 0.0953 0.1598 0.1316 0.1139 0.1212 0.1294 0.1202 0.1224
va: 1.2222 2.0355 2.1338 3.0788 3.2433 3.1346 3.9773 3.9154 3.9829 3.8871 3.9458 3.9373 3.9454 3.8690 4.3075 3.8327 3.6171 3.9124 4.0504 4.0134 4.0060 4.0625 4.0065 4.0005 3.9313 0.9946 0.9871 1.0184 1.0268 1.0094 1.0117 1.0067 1.0079 1.0122 1.0037 0.9959 1.0037 1.0060 1.0086 1.0132 1.0121 1.0107 0.9938 1.0100 1.0101 1.0096 1.0108 1.0122 1.0112
dispcorr: -0.028737743 hartree
energy: -1513.520922161787
dipole: 33.93093 -32.31358 1.61735 0.73863 0.28468 1.02331 3.19865 -3.73584 -0.53719
magnitude: 1.98785 au
magnitude: 5.05271 debye
