program: Orca
programVersion: 4.2.1
elementType: Cl O O N N N C C C C C C C C C C C C C C C C C C C H H H H H H H H H H H H H H H H H H H H H H H H
charge: 0
multiplicity: 1
keywords: wb97x-d3
keywords: def2-TZVPP
keywords: def2/J RIJCOSX GRIDX6 NOFINALGRIDX
keywords: grid4 nofinalgrid
keywords: scfconv7
keywords: smallprint printgap noloewdin
keywords: NOSOSCF
formula: C19H24ClN3O2
InChI: InChI=1S/C19H24ClN3O2/c1-18(2)13-25-19(3,23(18)17(24)22-12-11-21-14-22)10-4-5-15-6-8-16(20)9-7-15/h6-9,11-12,14H,4-5,10,13H2,1-3H3
49 atoms
Cl -3.906357 2.67501 -3.195908
O  1.751126 1.335257 0.274427
O  2.498594 -2.790247 -1.046293
N  1.65298 -0.860091 -0.197229
N  1.803325 -2.805694 1.115177
N  0.743235 -3.890009 2.717182
C  1.490694 0.117183 0.92256
C  1.68689 -0.147165 -1.495163
C  1.236521 1.23747 -1.026574
C  0.051451 0.109137 1.464087
C  2.524203 -0.023712 2.026632
C  3.099739 -0.053329 -2.073722
C  0.707067 -0.733609 -2.500804
C  -0.315146 1.342293 2.286831
C  2.026153 -2.154273 -0.13752
C  -1.831552 1.56483 2.347272
C  -2.407719 1.854125 0.98859
C  2.760854 -3.482394 1.829433
C  0.604104 -3.114905 1.686001
C  -2.13288 3.061268 0.349638
C  -3.17161 0.915695 0.303444
C  2.086059 -4.116115 2.826735
C  -2.591247 3.323464 -0.930281
C  -3.637783 1.157766 -0.980856
C  -3.339716 2.362744 -1.593526
H  1.661259 2.038484 -1.631914
H  0.142636 1.340452 -1.046364
H  -0.098324 -0.778516 2.078257
H  -0.634543 0.011809 0.61848
H  3.527367 -0.127234 1.613061
H  2.322272 -0.868248 2.680324
H  2.509623 0.877695 2.639485
H  3.496706 -1.027626 -2.342676
H  3.781807 0.418743 -1.365668
H  3.080222 0.560433 -2.976034
H  -0.287686 -0.83643 -2.064909
H  0.622977 -0.067422 -3.361176
H  1.029477 -1.706109 -2.866013
H  0.070092 1.244643 3.304858
H  0.153676 2.233041 1.864786
H  -2.040845 2.397982 3.022874
H  -2.32095 0.688933 2.781098
H  3.804945 -3.437293 1.572704
H  -0.331937 -2.776069 1.271014
H  -1.545265 3.815593 0.859785
H  -3.410257 -0.029053 0.777383
H  2.494018 -4.728947 3.61432
H  -2.370374 4.267355 -1.409421
H  -4.228509 0.414665 -1.498629
totalener: -1513.49237658 hartree
nucrepener: 2462.67428965 hartree
electener: -3976.16666624 hartree
oneelecener: -6961.91307027 hartree
twoeener: 2985.74640404 hartree
kineticenergy: 1508.19669645 hartree
xcener: -124.309369857865 hartree
chargesum: 0.0000000
charge: -0.079683 -0.336216 -0.363665 -0.092474 -0.033911 -0.296160 0.378850 0.110259 0.069537 -0.316967 -0.316339 -0.335439 -0.309275 -0.159881 0.321710 -0.118545 0.077049 -0.124417 0.006283 -0.216092 -0.180074 -0.077752 -0.116859 -0.127311 0.081703 0.097478 0.047962 0.120525 0.072414 0.106168 0.108025 0.111477 0.121385 0.101679 0.089449 0.085707 0.100736 0.121595 0.089461 0.093682 0.100777 0.082158 0.145258 0.146214 0.114785 0.121650 0.129149 0.123272 0.124666
qa: -0.0797 -0.3362 -0.3637 -0.0925 -0.0339 -0.2962 0.3788 0.1103 0.0695 -0.3170 -0.3163 -0.3354 -0.3093 -0.1599 0.3217 -0.1185 0.0770 -0.1244 0.0063 -0.2161 -0.1801 -0.0778 -0.1169 -0.1273 0.0817 0.0975 0.0480 0.1205 0.0724 0.1062 0.1080 0.1115 0.1214 0.1017 0.0894 0.0857 0.1007 0.1216 0.0895 0.0937 0.1008 0.0822 0.1453 0.1462 0.1148 0.1216 0.1291 0.1233 0.1247
va: 1.2270 2.0126 2.1383 3.0982 3.2776 3.1243 3.9685 4.0103 3.9602 3.9017 3.9564 3.9166 3.9142 3.8572 4.2688 3.8773 3.5986 3.9149 4.0535 3.9867 3.9381 4.0201 3.9798 3.9926 3.9202 0.9967 0.9988 1.0187 1.0189 1.0104 0.9914 1.0096 1.0228 1.0079 1.0044 1.0057 1.0037 1.0137 1.0094 1.0308 1.0053 1.0130 1.0106 0.9957 1.0116 1.0086 1.0086 1.0111 1.0104
dispcorr: -0.030513593 hartree
energy: -1513.522890177795
dipole: 16.87296 -16.69232 0.18064 -0.45991 1.88747 1.42756 11.40032 -11.16787 0.23245
magnitude: 1.45759 au
magnitude: 3.70491 debye
