program: Orca
programVersion: 4.2.1
elementType: Cl O O N N N C C C C C C C C C C C C C C C C C C C H H H H H H H H H H H H H H H H H H H H H H H H
charge: 0
multiplicity: 1
keywords: wb97x-d3
keywords: def2-TZVPP
keywords: def2/J RIJCOSX GRIDX6 NOFINALGRIDX
keywords: grid4 nofinalgrid
keywords: scfconv7
keywords: smallprint printgap noloewdin
keywords: NOSOSCF
formula: C19H24ClN3O2
InChI: InChI=1S/C19H24ClN3O2/c1-18(2)13-25-19(3,23(18)17(24)22-12-11-21-14-22)10-4-5-15-6-8-16(20)9-7-15/h6-9,11-12,14H,4-5,10,13H2,1-3H3
49 atoms
Cl -5.48636 -0.50107 1.221958
O  2.989178 1.460145 0.816447
O  2.871399 -2.679525 -0.656957
N  2.574924 -0.440948 -0.338308
N  0.746026 -1.87639 -0.623464
N  -1.249799 -1.82679 -1.564908
C  1.924403 0.583021 0.543037
C  3.991826 -0.089018 -0.560483
C  3.891837 1.401919 -0.253782
C  0.79086 1.335512 -0.16101
C  1.471268 -0.015846 1.866564
C  4.950227 -0.760982 0.424682
C  4.415184 -0.337485 -2.000331
C  0.381007 2.640167 0.514055
C  2.15923 -1.71744 -0.522146
C  -0.920482 3.201352 -0.075021
C  -2.104327 2.31999 0.212615
C  -0.002637 -2.852215 -0.008209
C  -0.060029 -1.313504 -1.572103
C  -2.754955 2.390471 1.441878
C  -2.537404 1.363772 -0.699387
C  -1.232874 -2.778678 -0.58189
C  -3.797823 1.535226 1.756086
C  -3.569096 0.487864 -0.399412
C  -4.195678 0.58244 0.830527
H  4.841993 1.833497 0.062121
H  3.531987 1.96309 -1.128386
H  -0.077605 0.67999 -0.20703
H  1.076459 1.545455 -1.1974
H  0.588827 -0.640834 1.741658
H  1.212737 0.776238 2.568145
H  2.267087 -0.610482 2.314611
H  4.680295 -0.539807 1.45751
H  5.961946 -0.385712 0.260427
H  4.96835 -1.839397 0.295509
H  5.396399 0.105754 -2.177892
H  4.490844 -1.399606 -2.224138
H  3.711347 0.114382 -2.700599
H  0.238289 2.491631 1.587592
H  1.173587 3.383218 0.411054
H  -0.80665 3.334732 -1.154589
H  -1.093692 4.197564 0.338842
H  0.401091 -3.479777 0.76699
H  0.300511 -0.555222 -2.249092
H  -2.443268 3.128504 2.172075
H  -2.05571 1.281117 -1.666047
H  -2.109585 -3.357944 -0.341914
H  -4.29643 1.605403 2.713006
H  -3.860911 -0.26828 -1.114174
totalener: -1513.49148421 hartree
nucrepener: 2475.93706032 hartree
electener: -3989.42854453 hartree
oneelecener: -6989.00435999 hartree
twoeener: 2999.57581546 hartree
kineticenergy: 1508.19647440 hartree
xcener: -124.307887260478 hartree
chargesum: -0.0000000
charge: -0.088006 -0.338120 -0.349517 -0.099611 -0.011842 -0.319416 0.351520 0.123040 0.039845 -0.231462 -0.321890 -0.336214 -0.301636 -0.165584 0.295968 -0.117281 0.092626 -0.145603 0.016269 -0.214604 -0.186732 -0.042750 -0.122891 -0.123966 0.090907 0.094721 0.067602 0.068163 0.084805 0.106355 0.106364 0.107134 0.100707 0.090372 0.121300 0.097069 0.121520 0.085286 0.081258 0.082308 0.083694 0.095453 0.153774 0.144396 0.112858 0.128712 0.129859 0.118562 0.124678
qa: -0.0880 -0.3381 -0.3495 -0.0996 -0.0118 -0.3194 0.3515 0.1230 0.0398 -0.2315 -0.3219 -0.3362 -0.3016 -0.1656 0.2960 -0.1173 0.0926 -0.1456 0.0163 -0.2146 -0.1867 -0.0428 -0.1229 -0.1240 0.0909 0.0947 0.0676 0.0682 0.0848 0.1064 0.1064 0.1071 0.1007 0.0904 0.1213 0.0971 0.1215 0.0853 0.0813 0.0823 0.0837 0.0955 0.1538 0.1444 0.1129 0.1287 0.1299 0.1186 0.1247
va: 1.2194 1.9959 2.1463 3.0430 3.2554 3.0883 4.0148 4.0112 3.9981 3.9348 3.9628 3.9151 3.9019 3.9470 4.2851 3.8436 3.5617 3.9122 4.0177 4.0302 3.9487 3.9756 4.0154 3.9813 3.9132 0.9942 0.9972 1.0301 1.0099 1.0021 1.0118 1.0036 1.0080 1.0057 1.0205 1.0037 1.0124 1.0112 1.0118 1.0271 1.0124 1.0088 1.0092 0.9973 1.0096 1.0030 1.0060 1.0129 1.0233
dispcorr: -0.031128414 hartree
energy: -1513.522612621548
dipole: 34.39584 -32.92120 1.47464 12.35059 -11.00567 1.34492 -2.33421 2.62983 0.29561
magnitude: 2.01761 au
magnitude: 5.12836 debye
