program: Orca
programVersion: 4.2.1
elementType: Cl O O N N N C C C C C C C C C C C C C C C C C C C H H H H H H H H H H H H H H H H H H H H H H H H
charge: 0
multiplicity: 1
keywords: wb97x-d3
keywords: def2-TZVPP
keywords: def2/J RIJCOSX GRIDX6 NOFINALGRIDX
keywords: grid4 nofinalgrid
keywords: scfconv7
keywords: smallprint printgap noloewdin
keywords: NOSOSCF
formula: C19H24ClN3O2
InChI: InChI=1S/C19H24ClN3O2/c1-18(2)13-25-19(3,23(18)17(24)22-12-11-21-14-22)10-4-5-15-6-8-16(20)9-7-15/h6-9,11-12,14H,4-5,10,13H2,1-3H3
49 atoms
Cl -6.145164 1.65328 -1.558188
O  2.371608 1.677097 0.04566
O  2.473487 -1.719097 2.373771
N  2.200286 -0.526302 0.457768
N  1.811118 -2.843966 0.522233
N  1.880674 -4.975266 -0.037487
C  2.380592 0.788972 1.133525
C  2.425973 -0.396148 -1.003739
C  3.000912 1.027562 -1.020507
C  1.219146 1.125054 2.067602
C  3.713839 0.902342 1.877191
C  3.446209 -1.380716 -1.561533
C  1.14242 -0.426205 -1.832212
C  -0.184166 1.076421 1.466423
C  2.19652 -1.654458 1.201337
C  -0.617191 2.34624 0.727033
C  -1.997932 2.211107 0.150512
C  0.617546 -3.123382 -0.101814
C  2.515183 -4.011534 0.554061
C  -3.124217 2.256713 0.96804
C  -2.190992 1.994094 -1.209319
C  0.689699 -4.439703 -0.439161
C  -4.398904 2.08736 0.454029
C  -3.458598 1.821535 -1.744369
C  -4.558503 1.866935 -0.905232
H  4.093368 1.010818 -0.905908
H  2.769696 1.557307 -1.945078
H  1.412758 2.119914 2.481039
H  1.274804 0.439527 2.913714
H  4.55377 0.574152 1.26398
H  3.722706 0.31432 2.789543
H  3.877831 1.948337 2.137859
H  3.770503 -1.038142 -2.545973
H  3.04115 -2.382108 -1.692942
H  4.331676 -1.44312 -0.927397
H  1.365378 -0.115818 -2.854448
H  0.713391 -1.422687 -1.892476
H  0.388845 0.252886 -1.43365
H  -0.284995 0.21236 0.803987
H  -0.893529 0.894336 2.277841
H  0.093674 2.580543 -0.064205
H  -0.587187 3.188899 1.424503
H  -0.17291 -2.398971 -0.18861
H  3.490193 -4.076042 1.011585
H  -3.007609 2.433383 2.031009
H  -1.334503 1.967198 -1.872637
H  -0.05981 -5.034304 -0.936384
H  -5.26272 2.128948 1.10307
H  -3.589188 1.657278 -2.805126
totalener: -1513.49095032 hartree
nucrepener: 2413.64335629 hartree
electener: -3927.13430660 hartree
oneelecener: -6863.75741257 hartree
twoeener: 2936.62310597 hartree
kineticenergy: 1508.19613307 hartree
xcener: -124.309156638896 hartree
chargesum: -0.0000000
charge: -0.084873 -0.343291 -0.362388 -0.078503 -0.020517 -0.291755 0.241455 0.112999 0.075530 -0.157778 -0.307753 -0.340265 -0.334673 -0.158175 0.307448 -0.114639 0.055099 -0.165036 0.038822 -0.187800 -0.164679 -0.082960 -0.130805 -0.137971 0.083737 0.071617 0.090537 0.086827 0.120845 0.081023 0.118954 0.103804 0.107798 0.116774 0.103461 0.099202 0.117423 0.075247 0.060408 0.099086 0.099679 0.086318 0.169808 0.137068 0.116171 0.115926 0.132248 0.120214 0.118332
qa: -0.0849 -0.3433 -0.3624 -0.0785 -0.0205 -0.2918 0.2415 0.1130 0.0755 -0.1578 -0.3078 -0.3403 -0.3347 -0.1582 0.3074 -0.1146 0.0551 -0.1650 0.0388 -0.1878 -0.1647 -0.0830 -0.1308 -0.1380 0.0837 0.0716 0.0905 0.0868 0.1208 0.0810 0.1190 0.1038 0.1078 0.1168 0.1035 0.0992 0.1174 0.0752 0.0604 0.0991 0.0997 0.0863 0.1698 0.1371 0.1162 0.1159 0.1322 0.1202 0.1183
va: 1.2216 2.0025 2.1442 3.0552 3.2478 3.1328 4.1446 3.9131 3.8952 3.7600 3.9288 3.9623 3.9232 3.9047 4.2780 3.7680 3.5956 3.9099 4.0532 4.0283 3.9919 4.0688 4.0210 4.0389 3.9290 1.0035 0.9956 1.0147 1.0214 1.0085 1.0216 1.0107 1.0052 0.9963 1.0022 1.0115 1.0133 1.0118 1.0229 1.0151 1.0295 1.0146 0.9860 1.0104 1.0082 1.0043 1.0103 1.0122 1.0138
dispcorr: -0.029853691 hartree
energy: -1513.520804007964
dipole: 30.59845 -29.71336 0.88508 3.04302 -1.63070 1.41233 1.92944 -2.54698 -0.61755
magnitude: 1.77747 au
magnitude: 4.51797 debye
