program: Orca
programVersion: 4.2.1
elementType: Cl O O N N N C C C C C C C C C C C C C C C C C C C H H H H H H H H H H H H H H H H H H H H H H H H
charge: 0
multiplicity: 1
keywords: wb97x-d3
keywords: def2-TZVPP
keywords: def2/J RIJCOSX GRIDX6 NOFINALGRIDX
keywords: grid4 nofinalgrid
keywords: scfconv7
keywords: smallprint printgap noloewdin
keywords: NOSOSCF
formula: C19H24ClN3O2
InChI: InChI=1S/C19H24ClN3O2/c1-18(2)13-25-19(3,23(18)17(24)22-12-11-21-14-22)10-4-5-15-6-8-16(20)9-7-15/h6-9,11-12,14H,4-5,10,13H2,1-3H3
49 atoms
Cl -4.513516 2.139683 -2.873958
O  2.181461 1.497295 0.541467
O  1.637047 -2.307209 -1.606107
N  2.208783 -0.652144 -0.15649
N  1.224843 -2.66079 0.59139
N  -0.128097 -4.054951 1.635144
C  1.831045 0.217074 1.005034
C  2.870727 0.159512 -1.202826
C  3.255109 1.361592 -0.346971
C  0.323768 0.215649 1.257694
C  2.636595 -0.088429 2.267135
C  4.103232 -0.525102 -1.774513
C  1.909097 0.599128 -2.30898
C  -0.157529 1.325084 2.185735
C  1.699259 -1.859688 -0.488306
C  -1.678678 1.290289 2.369428
C  -2.423488 1.500959 1.080383
C  1.916614 -3.135359 1.680742
C  0.00899 -3.278509 0.605494
C  -3.06832 0.45225 0.434145
C  -2.445737 2.754296 0.47422
C  1.059705 -3.987112 2.306879
C  -3.71363 0.637611 -0.779672
C  -3.084597 2.959749 -0.73681
C  -3.715828 1.894279 -1.360055
H  4.206022 1.189986 0.178268
H  3.348976 2.278757 -0.929068
H  0.027798 -0.744203 1.685044
H  -0.182596 0.306917 0.292835
H  2.587858 0.767116 2.939785
H  3.686441 -0.272881 2.038405
H  2.24761 -0.950441 2.802174
H  4.756177 -0.887218 -0.979204
H  4.670966 0.189343 -2.373315
H  3.845019 -1.362115 -2.418563
H  1.04912 1.130565 -1.900119
H  2.425959 1.27861 -2.98912
H  1.549399 -0.244041 -2.891403
H  0.308315 1.228934 3.169748
H  0.138275 2.29942 1.792524
H  -1.963923 2.061494 3.089561
H  -1.971997 0.335057 2.812647
H  2.94061 -2.870707 1.874623
H  -0.72922 -3.096957 -0.16015
H  -3.068627 -0.533768 0.883806
H  -1.954368 3.591784 0.955677
H  1.239804 -4.565463 3.198866
H  -4.210059 -0.18925 -1.268519
H  -3.094653 3.940067 -1.192959
totalener: -1513.49219456 hartree
nucrepener: 2447.00925203 hartree
electener: -3960.50144659 hartree
oneelecener: -6930.85287136 hartree
twoeener: 2970.35142477 hartree
kineticenergy: 1508.19885403 hartree
xcener: -124.308340090523 hartree
chargesum: -0.0000000
charge: -0.083528 -0.327857 -0.360911 -0.091009 -0.029843 -0.293742 0.277650 0.128717 0.059550 -0.215791 -0.356468 -0.306095 -0.342578 -0.135925 0.320082 -0.120897 0.031228 -0.163064 0.033804 -0.160346 -0.175033 -0.080453 -0.124542 -0.135438 0.087791 0.065562 0.091735 0.092734 0.104803 0.111659 0.097466 0.117434 0.085122 0.097424 0.122219 0.104698 0.089765 0.120545 0.077033 0.090148 0.100807 0.087170 0.168018 0.137098 0.118024 0.111967 0.129903 0.122735 0.120627
qa: -0.0835 -0.3279 -0.3609 -0.0910 -0.0298 -0.2937 0.2777 0.1287 0.0595 -0.2158 -0.3565 -0.3061 -0.3426 -0.1359 0.3201 -0.1209 0.0312 -0.1631 0.0338 -0.1603 -0.1750 -0.0805 -0.1245 -0.1354 0.0878 0.0656 0.0917 0.0927 0.1048 0.1117 0.0975 0.1174 0.0851 0.0974 0.1222 0.1047 0.0898 0.1205 0.0770 0.0901 0.1008 0.0872 0.1680 0.1371 0.1180 0.1120 0.1299 0.1227 0.1206
va: 1.2226 2.0024 2.1386 3.0595 3.2626 3.1260 4.0300 3.9967 3.9586 3.8625 3.9366 3.8985 3.9201 3.8731 4.2738 3.8452 3.6218 3.9060 4.0467 3.9439 4.0140 4.0585 4.0164 4.0194 3.9261 1.0004 0.9954 1.0110 1.0119 1.0124 1.0096 1.0030 1.0104 1.0028 1.0139 1.0068 1.0053 1.0205 1.0145 1.0261 1.0060 1.0134 0.9906 1.0115 1.0105 1.0104 1.0097 1.0112 1.0121
dispcorr: -0.029123734 hartree
energy: -1513.521318293291
dipole: 27.49467 -25.96207 1.53260 1.97349 -0.60155 1.37194 13.75780 -12.90586 0.85193
magnitude: 2.22641 au
magnitude: 5.65907 debye
