program: Gaussian 09
title: 000034454
version: EM64L-G09RevD.01
frameworkgroup: C1[X(C16H14)]
method: RPBEPBE
basis: SDD
operation: Freq
keyword: #p
keyword: freq=noraman
keyword: PBEPBE/SDD
title: #p freq=noraman PBEPBE/SDD
converged: NO YES NO YES
title: Mulliken charges:
elementType: C C C C C C C C C C C C C C C C H H H H H H H H H H H H H H
charge: 0.241544 0.252081 0.183160 0.268150 0.364539 -0.753804 0.297161 -0.399161 -0.374979 -0.393420 -0.458216 -0.864901 -0.259939 -0.834439 -0.264571 -0.266201 0.245979 0.223911 0.223198 0.248112 0.232190 0.231356 0.244303 0.231357 0.225010 0.238333 0.232504 0.232506 0.227275 0.226962
chargesum: 0.00000
title: Mulliken charges with hydrogens summed into heavy atoms:
elementType: C C C C C C C C C C C C C C C C
charge: 0.241544 0.252081 0.183160 0.268150 0.364539 -0.507825 0.297161 -0.175250 -0.151781 -0.145308 -0.226026 -0.157885 -0.034930 -0.131095 -0.037296 -0.039239
polarizability: 2.71875573e+02 -3.17599444e+00 1.97214456e+02 7.31881401e-03 9.04612301e-04 7.55025048e+01
1716.lowfreq: -6.6056 -0.0011 -0.0003 0.0008 9.3735 11.4423 64.8667 97.3506 142.7672
frequency: 64.8449 97.3499 142.7664 183.0938 193.6838 214.0713 216.5764 247.2122 275.0481 325.8067 326.7692 415.0870 416.1645 436.4093 479.3915 501.9976 535.4758 538.0238 558.6781 578.3689 615.6329 619.4918 691.3151 746.4396 759.6895 764.5233 771.4109 830.3363 847.2112 872.2426 888.5287 897.7571 914.4699 956.3064 975.2684 990.0033 994.2014 998.7430 1037.3510 1047.5858 1050.8049 1060.4805 1073.9006 1094.3404 1154.6290 1179.8222 1190.0473 1245.4696 1254.0894 1264.3174 1279.9567 1311.4108 1376.5725 1393.6180 1396.7667 1401.3583 1405.7567 1417.7447 1449.2119 1460.7589 1471.2667 1473.8252 1474.6653 1484.4218 1498.2825 1535.6913 1582.9790 1610.2344 1619.3910 1628.6819 2969.0686 2971.3428 3043.1179 3046.2716 3082.5406 3083.7330 3120.5810 3125.9651 3136.9864 3140.1240 3141.9231 3153.2993 3161.9922 3167.7574
redmass: 3.6127 3.6783 3.3702 1.3470 1.5754 1.2360 3.6189 3.2725 3.1800 3.7489 3.4507 2.9685 5.4660 4.1361 3.5532 5.7619 3.1657 4.9168 3.8691 2.8442 3.0149 6.3438 5.6603 2.9590 5.2533 1.2567 1.5823 1.7622 3.7790 5.4687 1.8147 1.3906 1.7722 1.3965 1.3546 1.3301 1.6899 2.0357 2.8386 1.5554 1.5946 3.6999 1.9734 1.8091 1.5764 1.0822 1.3109 2.2092 1.9107 1.8216 1.6882 3.1486 2.5575 2.7082 1.8038 1.8818 1.6998 2.5872 2.5016 2.7085 1.0460 1.3169 1.0456 1.1580 2.5192 4.0433 7.5956 5.5730 6.3268 6.6211 1.0378 1.0378 1.0971 1.0975 1.0981 1.0981 1.0866 1.0849 1.0900 1.0902 1.0901 1.0952 1.0977 1.0976
irintensity: 0.0687 0.6563 3.5928 2.6433 0.0515 0.0008 0.4424 0.6577 0.1936 0.6343 1.4048 5.5564 0.2463 0.9769 0.1054 1.9400 1.0445 5.2349 0.6198 2.0250 0.1282 0.7207 3.2774 0.5954 0.3196 112.5760 25.4842 9.2740 0.1144 2.0554 3.0346 12.1723 4.8723 1.3811 1.1031 0.0316 5.1298 2.2091 10.6574 8.4672 4.3766 1.1443 0.2839 6.7366 3.7218 0.1903 1.1177 7.1243 5.0713 0.7823 2.9202 0.5667 2.8844 0.5472 12.9014 9.7988 6.9261 14.0092 11.5216 5.0200 18.8681 10.1967 8.8357 20.3146 10.3540 4.3028 2.4054 8.9358 1.5840 8.6355 38.0392 37.7835 18.6675 21.3752 20.1598 21.2074 8.3132 1.1800 25.8596 18.2238 8.8600 8.3625 48.9300 34.1936
temp: 298.150 k
press: 1.00000 atm
elementType: 6 6 6 6 6 6 6 6 6 6 6 6 6 6 6 6 1 1 1 1 1 1 1 1 1 1 1 1 1 1
symmnumber: 1
zpe: 646883.8 jmol-1
zpe.correction: 0.246385 hartree
zpe.thermalcorrener: 0.259178 hartree
zpe.thermalcorrenthalpy: 0.260122 hartree
zpe.thermalcorrgfe: 0.207963 hartree
zpe.sumelectzpe: -617.038958 hartree
zpe.sumelectthermal: -617.026165 hartree
zpe.sumelectthermalent: -617.025221 hartree
zpe.sumelectthermalfe: -617.077380 hartree
dipole: 0.0113 0.7225 0.0000
dipole: 0.7226
quadrupole: -81.4343 -81.4400 -100.9789
quadrupole: 0.4215 0.0008 0.0002
quadrupole: 6.5168 6.5111 -13.0279 0.4215 0.0008 0.0002
hfenergy: -617.2853429 hartree
pointgroup: C01 [X(C16H14)]
dipole: 0.0025671 0.28428 0.0000146 debye
polarizability: 271.9139253|-2.6873882|197.176104|0.0073127|0.0009525|75.5025048 unknown
InChI: InChI=1S/C16H14/c1-11-6-5-9-15-14-8-4-3-7-13(14)12(2)10-16(11)15/h3-10H,1-2H3
charge 0 multiplicity 1
30 atoms
C  0.560666 -0.773812 0.00006
C  1.333113 0.444979 0.000094
C  -0.9033 -0.688289 0.000007
C  -1.548492 0.604786 -0.000009
C  -0.742595 1.819167 0.000046
C  0.639151 1.712928 0.000096
C  2.774669 0.39133 0.00014
C  1.254539 -2.021865 0.000072
C  -1.730207 -1.854146 -0.000024
C  -2.978082 0.66863 -0.00007
C  3.409173 -0.861322 0.000158
C  -1.406283 3.184023 0.00005
C  2.653189 -2.066037 0.000129
C  3.608465 1.661573 0.000167
C  -3.128409 -1.765849 -0.00008
C  -3.761254 -0.491731 -0.000106
H  1.235129 2.631869 0.000153
H  0.697852 -2.963304 0.000054
H  -1.270748 -2.847068 -0.000006
H  -3.468328 1.64721 -0.000089
H  4.504633 -0.909268 0.000184
H  -2.049464 3.327112 0.889634
H  -0.649329 3.985974 0.000148
H  -2.049313 3.327188 -0.889633
H  3.170486 -3.031927 0.000146
H  4.684482 1.418766 0.000072
H  3.404679 2.286937 -0.890004
H  3.404804 2.2868 0.890468
H  -3.733632 -2.679224 -0.000101
H  -4.854594 -0.42053 -0.000156
