program: Orca
programVersion: 4.2.1
elementType: Cl O O N N N C C C C C C C C C C C C C C C C C C C H H H H H H H H H H H H H H H H H H H H H H H H
charge: 0
multiplicity: 1
keywords: wb97x-d3
keywords: def2-TZVPP
keywords: def2/J RIJCOSX GRIDX6 NOFINALGRIDX
keywords: grid4 nofinalgrid
keywords: scfconv7
keywords: smallprint printgap noloewdin
keywords: NOSOSCF
formula: C19H24ClN3O2
InChI: InChI=1S/C19H24ClN3O2/c1-18(2)13-25-19(3,23(18)17(24)22-12-11-21-14-22)10-4-5-15-6-8-16(20)9-7-15/h6-9,11-12,14H,4-5,10,13H2,1-3H3
49 atoms
Cl -5.059976 1.744978 -2.50806
O  1.159811 1.321997 -0.224024
O  1.997632 -1.706269 2.454625
N  1.716186 -0.772426 0.405944
N  2.455916 -2.995203 0.641583
N  2.43718 -5.156564 0.208384
C  1.34918 0.570208 0.949467
C  1.532851 -0.802844 -1.063288
C  0.670388 0.454032 -1.206289
C  0.048473 0.491881 1.762566
C  2.498298 1.204833 1.713848
C  2.845884 -0.598226 -1.818666
C  0.7758 -2.01221 -1.595718
C  -0.393183 1.785816 2.443971
C  2.042673 -1.768565 1.250428
C  -0.762911 2.964333 1.539402
C  -1.831931 2.654437 0.526789
C  3.647173 -3.279085 0.019968
C  1.783718 -4.174074 0.749972
C  -3.065265 2.138078 0.919066
C  -1.629893 2.888505 -0.829195
C  3.605406 -4.615412 -0.24215
C  -4.059861 1.855514 -0.002726
C  -2.613722 2.614855 -1.767871
C  -3.826325 2.094702 -1.347986
H  0.783308 0.925329 -2.183452
H  -0.394195 0.224382 -1.064832
H  0.174138 -0.25778 2.541698
H  -0.755445 0.125637 1.117072
H  2.646024 0.731997 2.68127
H  2.295802 2.262777 1.878622
H  3.422552 1.129242 1.14136
H  3.503878 -1.45915 -1.736649
H  3.376855 0.284222 -1.462279
H  2.639849 -0.458267 -2.881088
H  -0.092875 -2.246399 -0.97983
H  0.411358 -1.780025 -2.598358
H  1.394413 -2.902647 -1.682997
H  -1.25677 1.535046 3.066036
H  0.372729 2.115091 3.150571
H  0.120626 3.342288 1.024914
H  -1.108549 3.781467 2.180352
H  4.413863 -2.539123 -0.126984
H  0.816102 -4.237975 1.223609
H  -3.264301 1.9538 1.968294
H  -0.68295 3.29447 -1.162739
H  4.36238 -5.216826 -0.7194
H  -5.011502 1.457209 0.322253
H  -2.438461 2.80747 -2.817706
totalener: -1513.49096057 hartree
nucrepener: 2446.69949264 hartree
electener: -3960.19045320 hartree
oneelecener: -6930.01596853 hartree
twoeener: 2969.82551533 hartree
kineticenergy: 1508.19141125 hartree
xcener: -124.311705822189 hartree
chargesum: -0.0000000
charge: -0.084617 -0.346310 -0.370592 -0.084524 -0.027035 -0.292469 0.388600 0.132739 -0.007841 -0.268143 -0.323844 -0.345739 -0.329144 -0.185965 0.318121 -0.088841 0.077416 -0.149191 0.039953 -0.210457 -0.203216 -0.092966 -0.113537 -0.113979 0.076074 0.095040 0.089014 0.127869 0.082550 0.121495 0.098896 0.091000 0.107119 0.115056 0.094786 0.101209 0.108384 0.115931 0.089640 0.091397 0.077722 0.098679 0.159451 0.135051 0.112387 0.120469 0.128596 0.122323 0.121444
qa: -0.0846 -0.3463 -0.3706 -0.0845 -0.0270 -0.2925 0.3886 0.1327 -0.0078 -0.2681 -0.3238 -0.3457 -0.3291 -0.1860 0.3181 -0.0888 0.0774 -0.1492 0.0400 -0.2105 -0.2032 -0.0930 -0.1135 -0.1140 0.0761 0.0950 0.0890 0.1279 0.0826 0.1215 0.0989 0.0910 0.1071 0.1151 0.0948 0.1012 0.1084 0.1159 0.0896 0.0914 0.0777 0.0987 0.1595 0.1351 0.1124 0.1205 0.1286 0.1223 0.1214
va: 1.2222 1.9900 2.1286 3.1517 3.2615 3.1328 3.9193 3.9460 3.9885 3.9027 3.9438 3.9386 3.9494 3.9054 4.2788 3.8183 3.6008 3.9057 4.0526 4.0005 3.9674 4.0627 3.9986 3.9765 3.9330 0.9951 0.9856 1.0353 1.0073 1.0141 0.9998 1.0144 1.0129 1.0057 1.0080 1.0055 1.0067 0.9966 1.0074 1.0068 1.0203 1.0025 0.9922 1.0087 1.0121 1.0121 1.0109 1.0112 1.0116
dispcorr: -0.030835579 hartree
energy: -1513.521796144993
dipole: 20.98687 -20.65299 0.33388 2.80285 -1.37435 1.42850 6.61784 -7.11611 -0.49826
magnitude: 1.54931 au
magnitude: 3.93802 debye
