program: Orca
programVersion: 4.2.1
elementType: Cl O O N N N C C C C C C C C C C C C C C C C C C C H H H H H H H H H H H H H H H H H H H H H H H H
charge: 0
multiplicity: 1
keywords: wb97x-d3
keywords: def2-TZVPP
keywords: def2/J RIJCOSX GRIDX6 NOFINALGRIDX
keywords: grid4 nofinalgrid
keywords: scfconv7
keywords: smallprint printgap noloewdin
keywords: NOSOSCF
formula: C19H24ClN3O2
InChI: InChI=1S/C19H24ClN3O2/c1-18(2)13-25-19(3,23(18)17(24)22-12-11-21-14-22)10-4-5-15-6-8-16(20)9-7-15/h6-9,11-12,14H,4-5,10,13H2,1-3H3
49 atoms
Cl -5.173511 1.60566 -2.18991
O  1.114096 1.317581 -0.411167
O  2.229774 -1.513468 2.376763
N  1.710476 -0.733621 0.310004
N  2.454079 -2.944977 0.628267
N  2.381068 -5.13501 0.387691
C  1.428338 0.653545 0.7873
C  1.323104 -0.879945 -1.11224
C  0.481166 0.392652 -1.248735
C  0.230927 0.662135 1.749408
C  2.66532 1.318387 1.366319
C  2.521215 -0.79154 -2.056626
C  0.468012 -2.101404 -1.421979
C  -0.125448 2.013242 2.366642
C  2.126751 -1.668523 1.184449
C  -0.585521 3.120025 1.4142
C  -1.730178 2.735916 0.516214
C  3.557944 -3.293618 -0.110778
C  1.801898 -4.103362 0.921854
C  -1.661302 2.939435 -0.85804
C  -2.899537 2.180932 1.031589
C  3.484622 -4.646988 -0.248471
C  -2.712406 2.600076 -1.696468
C  -3.959219 1.830784 0.21063
C  -3.858307 2.041435 -1.155497
H  0.479576 0.780828 -2.267806
H  -0.562347 0.214308 -0.956281
H  0.443081 -0.022772 2.568575
H  -0.643896 0.255488 1.233504
H  3.52015 1.173209 0.706165
H  2.909275 0.921794 2.348386
H  2.499234 2.391157 1.46268
H  2.170635 -0.725129 -3.08782
H  3.155754 -1.671639 -1.996639
H  3.124818 0.092356 -1.850934
H  1.045761 -3.018745 -1.511011
H  -0.309555 -2.246502 -0.67147
H  -0.029619 -1.945363 -2.381158
H  -0.9153 1.825121 3.098975
H  0.714733 2.388882 2.955787
H  0.247776 3.4652 0.801853
H  -0.885031 3.979969 2.021621
H  4.299681 -2.576849 -0.415578
H  0.900914 -4.116141 1.515548
H  -0.764378 3.370061 -1.286076
H  -2.996625 2.017514 2.098409
H  4.17548 -5.294944 -0.763646
H  -2.640072 2.769268 -2.762372
H  -4.858952 1.401534 0.630341
totalener: -1513.49078938 hartree
nucrepener: 2453.28325224 hartree
electener: -3966.77404162 hartree
oneelecener: -6943.19452071 hartree
twoeener: 2976.42047909 hartree
kineticenergy: 1508.19514640 hartree
xcener: -124.312658981790 hartree
chargesum: 0.0000000
charge: -0.084122 -0.345823 -0.370682 -0.082555 -0.027644 -0.293032 0.390152 0.130542 0.003764 -0.273534 -0.323657 -0.347016 -0.333309 -0.188103 0.319507 -0.089602 0.081443 -0.150847 0.039739 -0.193908 -0.222744 -0.090921 -0.117302 -0.108876 0.073830 0.094089 0.084487 0.128199 0.084204 0.091131 0.122063 0.098449 0.094458 0.107779 0.115144 0.115684 0.101908 0.108725 0.090317 0.091155 0.077495 0.097516 0.160209 0.134264 0.120781 0.113007 0.128686 0.122186 0.122766
qa: -0.0841 -0.3458 -0.3707 -0.0826 -0.0276 -0.2930 0.3902 0.1305 0.0038 -0.2735 -0.3237 -0.3470 -0.3333 -0.1881 0.3195 -0.0896 0.0814 -0.1508 0.0397 -0.1939 -0.2227 -0.0909 -0.1173 -0.1089 0.0738 0.0941 0.0845 0.1282 0.0842 0.0911 0.1221 0.0984 0.0945 0.1078 0.1151 0.1157 0.1019 0.1087 0.0903 0.0912 0.0775 0.0975 0.1602 0.1343 0.1208 0.1130 0.1287 0.1222 0.1228
va: 1.2226 1.9959 2.1288 3.1552 3.2612 3.1324 3.9192 3.9448 3.9801 3.8939 3.9411 3.9360 3.9511 3.9051 4.2765 3.8286 3.5891 3.9061 4.0542 3.9572 3.9929 4.0619 3.9739 3.9931 3.9327 0.9963 0.9867 1.0358 1.0069 1.0149 1.0138 1.0001 1.0081 1.0127 1.0057 0.9963 1.0048 1.0067 1.0062 1.0070 1.0189 1.0021 0.9917 1.0092 1.0122 1.0115 1.0106 1.0111 1.0110
dispcorr: -0.031035153 hartree
energy: -1513.521824532279
dipole: 20.72750 -20.50292 0.22458 3.12659 -1.72295 1.40364 4.75104 -5.37048 -0.61944
magnitude: 1.55060 au
magnitude: 3.94130 debye
