program: Orca
programVersion: 4.2.1
elementType: Cl O O N N N C C C C C C C C C C C C C C C C C C C H H H H H H H H H H H H H H H H H H H H H H H H
charge: 0
multiplicity: 1
keywords: wb97x-d3
keywords: def2-TZVPP
keywords: def2/J RIJCOSX GRIDX6 NOFINALGRIDX
keywords: grid4 nofinalgrid
keywords: scfconv7
keywords: smallprint printgap noloewdin
keywords: NOSOSCF
formula: C19H24ClN3O2
InChI: InChI=1S/C19H24ClN3O2/c1-18(2)13-25-19(3,23(18)17(24)22-12-11-21-14-22)10-4-5-15-6-8-16(20)9-7-15/h6-9,11-12,14H,4-5,10,13H2,1-3H3
49 atoms
Cl -5.401539 1.378237 -1.818535
O  1.538506 1.487599 -0.254959
O  2.294428 -1.65349 2.306556
N  1.805253 -0.681565 0.310869
N  2.001669 -3.014394 0.519089
N  2.651707 -5.069046 0.055012
C  1.623042 0.680483 0.895857
C  1.975642 -0.593478 -1.159749
C  2.326107 0.893182 -1.245822
C  0.299139 0.740298 1.655957
C  2.814249 1.135848 1.740761
C  3.117681 -1.429996 -1.721347
C  0.678473 -0.853031 -1.925727
C  -0.086445 2.0884 2.261983
C  2.051275 -1.728193 1.12729
C  -0.555848 3.169861 1.28081
C  -1.762357 2.749387 0.487734
C  0.948905 -3.620793 -0.12404
C  2.987402 -3.950329 0.619348
C  -1.664778 2.369781 -0.847032
C  -3.017756 2.698205 1.088174
C  1.377705 -4.88289 -0.400333
C  -2.775969 1.949291 -1.562715
C  -4.139195 2.280078 0.390959
C  -4.009799 1.903593 -0.936493
H  3.399648 1.052004 -1.071906
H  2.071097 1.328084 -2.212833
H  0.362557 0.015838 2.469357
H  -0.496022 0.392932 0.990784
H  2.810701 0.690596 2.730443
H  2.774575 2.219754 1.847839
H  3.764475 0.885911 1.267798
H  4.021953 -1.335339 -1.118845
H  3.353115 -1.068602 -2.724206
H  2.870252 -2.485045 -1.81655
H  -0.151561 -0.271004 -1.524648
H  0.808584 -0.575065 -2.973025
H  0.40376 -1.904273 -1.912282
H  -0.897054 1.898595 2.970952
H  0.735592 2.483898 2.86369
H  0.252377 3.454862 0.608557
H  -0.801943 4.064134 1.859924
H  -0.000753 -3.13569 -0.261273
H  3.928116 -3.737346 1.10276
H  -0.701537 2.400243 -1.338495
H  -3.12834 2.996847 2.124341
H  0.830024 -5.672572 -0.889234
H  -2.682267 1.661413 -2.600984
H  -5.10655 2.250871 0.873217
totalener: -1513.49104190 hartree
nucrepener: 2439.12484519 hartree
electener: -3952.61588709 hartree
oneelecener: -6914.88892898 hartree
twoeener: 2962.27304189 hartree
kineticenergy: 1508.19654974 hartree
xcener: -124.310507497670 hartree
chargesum: -0.0000000
charge: -0.086140 -0.333863 -0.366694 -0.078051 -0.026270 -0.292904 0.292815 0.121506 0.036469 -0.227723 -0.332491 -0.327784 -0.334331 -0.177055 0.310816 -0.086000 0.056299 -0.162221 0.044217 -0.218509 -0.174166 -0.084986 -0.113797 -0.132314 0.084710 0.077547 0.090807 0.124689 0.094558 0.126674 0.102372 0.086502 0.102378 0.107454 0.116665 0.101218 0.093802 0.108398 0.092324 0.086327 0.081015 0.097124 0.166048 0.137241 0.131593 0.114057 0.129793 0.119228 0.120654
qa: -0.0861 -0.3339 -0.3667 -0.0781 -0.0263 -0.2929 0.2928 0.1215 0.0365 -0.2277 -0.3325 -0.3278 -0.3343 -0.1771 0.3108 -0.0860 0.0563 -0.1622 0.0442 -0.2185 -0.1742 -0.0850 -0.1138 -0.1323 0.0847 0.0775 0.0908 0.1247 0.0946 0.1267 0.1024 0.0865 0.1024 0.1075 0.1167 0.1012 0.0938 0.1084 0.0923 0.0863 0.0810 0.0971 0.1660 0.1372 0.1316 0.1141 0.1298 0.1192 0.1207
va: 1.2207 1.9716 2.1336 3.0675 3.2609 3.1312 4.0131 3.9337 3.9423 3.8676 3.9609 3.9452 3.9245 3.9241 4.2845 3.7946 3.6326 3.9149 4.0510 3.9560 4.0118 4.0607 3.9803 4.0180 3.9264 1.0052 0.9944 1.0214 1.0078 1.0175 1.0022 1.0112 1.0047 1.0060 0.9964 1.0070 1.0094 1.0150 1.0061 1.0101 1.0315 1.0045 0.9911 1.0099 1.0112 1.0090 1.0109 1.0131 1.0116
dispcorr: -0.030453113 hartree
energy: -1513.521495018118
dipole: 24.32336 -23.90632 0.41704 5.33566 -3.87492 1.46074 3.57247 -4.15558 -0.58311
magnitude: 1.62718 au
magnitude: 4.13595 debye
