program: Gaussian 09
title: 000034461
version: EM64L-G09RevD.01
frameworkgroup: C1[X(C16H27N3O2)]
method: RPBEPBE
basis: SDD
operation: Freq
keyword: #p
keyword: freq=noraman
keyword: PBEPBE/SDD
title: #p freq=noraman PBEPBE/SDD
converged: YES YES NO NO
title: Mulliken charges:
elementType: O O N N N C C C C C C C C C C C C C C C C H H H H H H H H H H H H H H H H H H H H H H H H H H H
charge: -0.299769 -0.266495 -0.123443 -0.371327 -0.506397 -0.511364 0.354176 -0.302868 -0.305847 0.148620 -0.546736 0.487606 -0.352367 -0.430979 -0.685251 -0.691073 -0.680088 -0.243087 -0.391450 0.234473 -0.681880 0.227930 0.195077 0.205833 0.179982 0.180682 0.244649 0.278636 0.243538 0.226729 0.222859 0.219274 0.208395 0.205958 0.221782 0.212375 0.205725 0.251395 0.183958 0.243048 0.217440 0.213412 0.210986 0.208571 0.222232 0.322658 0.307462 0.304959
chargesum: 0.00000
title: Mulliken charges with hydrogens summed into heavy atoms:
elementType: O O N N N C C C C C C C C C C C C C C C C
charge: -0.299769 -0.266495 -0.123443 -0.048669 0.106024 -0.088356 0.354176 0.082946 0.119484 0.148620 -0.268099 0.487606 -0.108829 -0.204249 -0.034723 -0.050958 -0.222967 0.183919 0.039401 0.234473 -0.040091
polarizability: 2.56978868e+02 3.86023375e+00 2.01766234e+02 -1.43287015e+00 -7.49411882e+00 1.59411832e+02
1716.lowfreq: -7.1536 -0.0009 -0.0007 -0.0006 2.7031 8.1213 14.2451 18.9800 27.5942
frequency: 14.0999 18.9456 27.5087 32.6443 38.6672 42.4536 56.3049 78.8064 89.4342 93.5699 95.8290 129.9485 133.1238 150.1963 176.7325 189.7788 196.8695 214.8507 224.3264 230.5868 253.5082 262.1664 284.6288 291.9885 300.5351 331.2412 365.2195 390.3838 409.4452 432.8646 450.7889 462.0782 487.5055 509.5428 554.2222 587.7234 616.1545 635.3020 716.4896 725.0440 755.3889 762.5408 764.8108 771.0241 796.8330 797.4069 805.5404 832.4149 889.4727 893.4422 901.1812 911.2568 927.1329 931.8187 942.6133 949.0596 957.0123 983.0776 991.7241 1050.9607 1056.3570 1071.4766 1086.4189 1087.6583 1105.5455 1120.4720 1133.1566 1145.8986 1150.5012 1159.5458 1183.2471 1188.1691 1199.0443 1226.0109 1234.2865 1250.7166 1266.7360 1277.6491 1282.7435 1285.3923 1286.4191 1287.2082 1304.0466 1310.6367 1361.7094 1363.9436 1373.7892 1377.5833 1382.2470 1386.7941 1390.6875 1393.5633 1417.7015 1436.7179 1457.4555 1459.2000 1463.0207 1467.3637 1472.1831 1474.6621 1477.7293 1478.2975 1483.4655 1485.5503 1487.0426 1490.7530 1495.8641 1582.2393 1612.5271 1619.4801 1678.9412 2846.6319 2855.1089 2866.9809 2940.6552 2975.6410 2983.3862 2985.6404 2998.3319 2998.7023 3009.1366 3041.8049 3044.4252 3047.2646 3055.4192 3057.8499 3075.5871 3077.5463 3078.8065 3079.0024 3086.8620 3090.6001 3117.4319 3129.7535 3154.2733 3393.4804 3509.0351 3551.7619
redmass: 5.3699 4.4895 3.8697 3.2002 2.7153 3.3345 3.5254 1.8307 2.8727 3.0709 1.7851 2.5411 1.3361 3.3329 3.0114 2.0137 1.7247 1.8173 1.2279 2.6314 2.9195 3.2868 2.9897 2.8968 2.1441 3.5610 2.8549 2.9620 3.4679 3.0671 3.0583 3.2033 3.9761 3.5742 1.4890 3.2941 2.7727 5.1147 3.6989 4.4242 3.3237 3.2613 1.0808 1.8054 1.6073 1.1942 2.1357 1.6264 1.5236 1.3529 1.8274 1.9362 2.4586 1.9888 4.3775 1.7840 2.8442 2.3361 2.0410 2.8138 2.5928 1.9679 1.9696 1.9975 2.0134 1.9383 2.1882 1.4371 1.9231 1.8730 1.8060 2.3017 2.0134 1.3253 1.9987 1.4857 1.5839 1.1154 1.1842 1.3044 1.1854 1.3085 2.0788 1.3881 1.3264 1.3207 1.6882 2.7066 1.3529 1.2800 1.2360 1.2354 3.0806 1.6392 1.1410 1.1048 1.0638 1.0518 1.0843 1.0623 1.0623 1.0434 1.1317 1.9649 1.0792 1.0795 1.1231 7.4687 6.4023 7.0446 1.0648 1.0724 1.0725 1.0706 1.0574 1.0357 1.0354 1.0357 1.0641 1.0591 1.1010 1.0865 1.0881 1.1017 1.0867 1.1024 1.1019 1.0983 1.0980 1.0988 1.1001 1.0999 1.0891 1.0918 1.0954 1.0428 1.0987 1.0796
irintensity: 1.9881 0.7176 1.2740 0.3741 0.7656 1.4532 1.1498 0.1583 0.7023 2.0969 0.1345 4.3545 22.0185 1.5037 0.2507 5.8561 0.7031 3.7735 1.0425 2.6396 6.7482 3.7710 11.9250 4.0999 2.0215 4.7783 6.5533 13.3092 1.4643 2.7614 2.7255 5.7575 19.2999 16.8661 129.3489 5.3503 46.6675 2.3185 7.7551 8.7823 11.2201 16.2597 8.5908 125.9616 16.1809 6.8560 5.3472 9.3260 9.4489 3.8751 0.9986 3.7895 18.5757 2.1074 28.6089 24.8118 61.6341 7.7139 6.2490 10.1363 27.3834 18.5332 4.6745 52.5038 25.1476 15.9917 0.5811 1.3605 18.2355 17.7214 20.3620 19.5855 83.5210 5.4847 30.3252 8.1113 7.6339 0.9532 9.1742 10.1663 4.1919 26.6521 36.3157 0.9458 0.9753 12.0296 4.7951 1.7320 3.1094 21.6680 15.9120 32.4462 7.5038 148.3251 45.4157 1.5801 6.8041 10.3550 6.2929 5.1340 10.0795 6.7767 10.7275 86.8731 9.0898 7.1848 10.9717 1.0003 30.7663 128.5958 24.9230 52.1527 36.1015 219.9776 43.1772 38.1923 32.2242 25.5469 30.3787 30.4815 6.4155 11.5282 2.8234 1.3552 10.2213 10.9780 101.2483 27.9498 75.8891 31.5674 53.3205 42.2495 19.2627 3.0723 12.5667 0.3122 1.8213 31.7836
temp: 298.150 k
press: 1.00000 atm
elementType: 8 8 7 7 7 6 6 6 6 6 6 6 6 6 6 6 6 6 6 6 6 1 1 1 1 1 1 1 1 1 1 1 1 1 1 1 1 1 1 1 1 1 1 1 1 1 1 1
symmnumber: 1
zpe: 1078057.8 jmol-1
zpe.correction: 0.410611 hartree
zpe.thermalcorrener: 0.435374 hartree
zpe.thermalcorrenthalpy: 0.436318 hartree
zpe.thermalcorrgfe: 0.352189 hartree
zpe.sumelectzpe: -938.913224 hartree
zpe.sumelectthermal: -938.888460 hartree
zpe.sumelectthermalent: -938.887516 hartree
zpe.sumelectthermalfe: -938.971645 hartree
dipole: -0.9134 -0.5211 1.3256
dipole: 1.6921
quadrupole: -116.7013 -123.8005 -129.8039
quadrupole: 10.9898 1.7851 -2.3204
quadrupole: 6.7339 -0.3652 -6.3687 10.9898 1.7851 -2.3204
hfenergy: -939.3238341 hartree
pointgroup: C01 [X(C16H27N3O2)]
dipole: 0.3879776 0.3695469 0.3950652 debye
polarizability: 257.1273678|-2.0964166|199.2947033|2.3479142|-12.150586|161.7348635 unknown
InChI: InChI=1S/C16H27N3O2/c1-4-9-21-15-8-7-13(11-16(20)18-17)10-14(15)12-19(5-2)6-3/h7-8,10,18H,4-6,9,11-12,17H2,1-3H3
charge 0 multiplicity 1
48 atoms
O  -1.906898 1.63847 -1.307893
O  3.602426 -1.811242 0.481927
N  -1.936551 -1.373448 0.31503
N  4.866515 0.071431 0.981999
N  5.282772 -0.386947 2.261727
C  -1.301203 -1.220948 -1.034953
C  -0.222447 -0.15138 -1.095182
C  -3.146063 -2.243939 0.226978
C  -0.964927 -1.873696 1.332208
C  -0.555799 1.229649 -1.201079
C  1.146624 -0.507855 -1.102143
C  2.176766 0.462826 -1.179821
C  0.458304 2.208718 -1.289238
C  1.818232 1.828948 -1.273768
C  -4.365754 -1.549658 -0.407921
C  -1.42113 -1.613476 2.780037
C  3.642588 0.03505 -1.162327
C  -2.566452 1.959157 -0.008395
C  -3.987941 2.426893 -0.325797
C  4.024451 -0.661977 0.153882
C  -4.774919 2.769067 0.958841
H  -2.10272 -0.947628 -1.742354
H  -0.8647 -2.194631 -1.373223
H  -3.415038 -2.548488 1.254047
H  -2.915479 -3.186714 -0.333976
H  -0.755323 -2.964591 1.187404
H  -0.00845 -1.348145 1.167413
H  1.423667 -1.566393 -1.027595
H  0.165593 3.258973 -1.393713
H  2.598016 2.596969 -1.350004
H  -4.641399 -0.652124 0.173033
H  -4.175235 -1.235446 -1.449399
H  -5.230857 -2.23866 -0.419488
H  -2.349032 -2.155777 3.037284
H  -1.602564 -0.534673 2.932548
H  -0.638187 -1.942057 3.488534
H  4.296387 0.906546 -1.350289
H  3.833619 -0.700426 -1.965894
H  -1.987499 2.759867 0.500426
H  -2.559707 1.041609 0.613947
H  -4.504544 1.627112 -0.888847
H  -3.939408 3.307721 -0.993611
H  -4.847928 1.891462 1.628759
H  -4.28637 3.584486 1.525001
H  -5.801942 3.096062 0.716882
H  5.164301 1.016891 0.737945
H  4.461853 -0.614234 2.841521
H  5.888653 -1.214253 2.165138
