program: Orca
programVersion: 4.2.1
elementType: Cl O O N N N C C C C C C C C C C C C C C C C C C C H H H H H H H H H H H H H H H H H H H H H H H H
charge: 0
multiplicity: 1
keywords: wb97x-d3
keywords: def2-TZVPP
keywords: def2/J RIJCOSX GRIDX6 NOFINALGRIDX
keywords: grid4 nofinalgrid
keywords: scfconv7
keywords: smallprint printgap noloewdin
keywords: NOSOSCF
formula: C19H24ClN3O2
InChI: InChI=1S/C19H24ClN3O2/c1-18(2)13-25-19(3,23(18)17(24)22-12-11-21-14-22)10-4-5-15-6-8-16(20)9-7-15/h6-9,11-12,14H,4-5,10,13H2,1-3H3
49 atoms
Cl -5.302304 1.354786 -2.058777
O  1.537908 1.475989 -0.212708
O  2.195838 -1.625239 2.423875
N  1.776002 -0.684979 0.39762
N  1.963623 -3.014515 0.649129
N  2.635531 -5.071975 0.230882
C  1.582751 0.687891 0.95354
C  1.983321 -0.623315 -1.069663
C  2.346705 0.85898 -1.171935
C  0.235986 0.767925 1.670223
C  2.75033 1.152082 1.82589
C  3.132958 -1.4759 -1.590008
C  0.702813 -0.887492 -1.861607
C  -0.164437 2.129556 2.234904
C  1.99233 -1.718549 1.23843
C  -0.592218 3.194323 1.2170
C  -1.763854 2.760492 0.379817
C  0.931689 -3.634658 -0.014045
C  2.950711 -3.943863 0.788451
C  -3.041202 2.703297 0.931614
C  -1.612461 2.376228 -0.948508
C  1.37356 -4.898393 -0.261161
C  -4.13212 2.274509 0.193691
C  -2.692479 1.945123 -1.704551
C  -3.949173 1.893345 -1.126098
H  3.416387 1.013201 -0.972145
H  2.12059 1.278771 -2.152765
H  0.269891 0.060412 2.500253
H  -0.538945 0.409827 0.987198
H  3.712556 0.895927 1.381061
H  2.719716 0.718898 2.820428
H  2.709308 2.237227 1.918802
H  3.39593 -1.130502 -2.591719
H  2.880748 -2.530524 -1.676639
H  4.022605 -1.378261 -0.966625
H  0.860731 -0.633244 -2.911103
H  0.418098 -1.935761 -1.83237
H  -0.131304 -0.289974 -1.493301
H  -1.001754 1.956712 2.916716
H  0.636309 2.533186 2.859496
H  0.2436 3.470073 0.575291
H  -0.863384 4.097346 1.770894
H  -0.015919 -3.155979 -0.184118
H  3.877123 -3.719691 1.29396
H  -3.193543 3.00565 1.961384
H  -0.63155 2.411702 -1.403114
H  0.842987 -5.697326 -0.753879
H  -5.117113 2.240722 0.638484
H  -2.556817 1.653783 -2.737209
totalener: -1513.49098119 hartree
nucrepener: 2440.89613177 hartree
electener: -3954.38711297 hartree
oneelecener: -6918.43331173 hartree
twoeener: 2964.04619876 hartree
kineticenergy: 1508.19605108 hartree
xcener: -124.310478827538 hartree
chargesum: -0.0000000
charge: -0.086063 -0.333861 -0.367035 -0.079458 -0.025971 -0.292841 0.295336 0.123540 0.033622 -0.227309 -0.331846 -0.327333 -0.334924 -0.178373 0.310758 -0.084103 0.057200 -0.162047 0.044633 -0.174824 -0.219066 -0.085573 -0.131405 -0.113914 0.084470 0.077654 0.090753 0.124636 0.094762 0.086107 0.126663 0.102271 0.107318 0.116599 0.102165 0.093469 0.108350 0.102568 0.092004 0.086329 0.079758 0.097581 0.165827 0.137102 0.114087 0.130865 0.129504 0.120306 0.119712
qa: -0.0861 -0.3339 -0.3670 -0.0795 -0.0260 -0.2928 0.2953 0.1235 0.0336 -0.2273 -0.3318 -0.3273 -0.3349 -0.1784 0.3108 -0.0841 0.0572 -0.1620 0.0446 -0.1748 -0.2191 -0.0856 -0.1314 -0.1139 0.0845 0.0777 0.0908 0.1246 0.0948 0.0861 0.1267 0.1023 0.1073 0.1166 0.1022 0.0935 0.1083 0.1026 0.0920 0.0863 0.0798 0.0976 0.1658 0.1371 0.1141 0.1309 0.1295 0.1203 0.1197
va: 1.2208 1.9710 2.1333 3.0697 3.2612 3.1313 4.0127 3.9312 3.9455 3.8685 3.9609 3.9447 3.9258 3.9237 4.2853 3.7933 3.6280 3.9148 4.0505 4.0118 3.9559 4.0609 4.0179 3.9766 3.9248 1.0053 0.9941 1.0215 1.0077 1.0113 1.0177 1.0022 1.0061 0.9965 1.0048 1.0095 1.0150 1.0060 1.0060 1.0101 1.0316 1.0043 0.9913 1.0098 1.0090 1.0111 1.0110 1.0117 1.0128
dispcorr: -0.030516331 hartree
energy: -1513.521497526055
dipole: 23.94791 -23.52733 0.42058 5.34573 -3.89489 1.45085 4.48509 -5.06997 -0.58488
magnitude: 1.61986 au
magnitude: 4.11735 debye
