program: Orca
programVersion: 4.2.1
elementType: Cl O O N N N C C C C C C C C C C C C C C C C C C C H H H H H H H H H H H H H H H H H H H H H H H H
charge: 0
multiplicity: 1
keywords: wb97x-d3
keywords: def2-TZVPP
keywords: def2/J RIJCOSX GRIDX6 NOFINALGRIDX
keywords: grid4 nofinalgrid
keywords: scfconv7
keywords: smallprint printgap noloewdin
keywords: NOSOSCF
formula: C19H24ClN3O2
InChI: InChI=1S/C19H24ClN3O2/c1-18(2)13-25-19(3,23(18)17(24)22-12-11-21-14-22)10-4-5-15-6-8-16(20)9-7-15/h6-9,11-12,14H,4-5,10,13H2,1-3H3
49 atoms
Cl -5.168043 1.308459 -2.287191
O  1.927945 1.502084 -0.631395
O  2.143581 -1.289426 2.404012
N  1.93828 -0.574231 0.255696
N  1.819329 -2.854297 0.791871
N  0.809967 -4.691974 0.1079
C  1.864011 0.869213 0.623377
C  2.216666 -0.723653 -1.193778
C  2.711057 0.700071 -1.465218
C  0.503705 1.183897 1.239458
C  3.03848 1.329649 1.487122
C  3.311038 -1.729097 -1.526174
C  0.958795 -0.9877 -2.020816
C  0.251495 2.667275 1.479802
C  1.989083 -1.507757 1.227715
C  -1.18822 2.940642 1.927952
C  -2.208689 2.545863 0.895943
C  2.649665 -3.899194 1.114636
C  0.714707 -3.40219 0.208092
C  -2.310966 3.248576 -0.302088
C  -3.049073 1.454697 1.08468
C  2.018124 -5.014607 0.6583
C  -3.215287 2.877564 -1.282441
C  -3.962069 1.066801 0.114908
C  -4.037808 1.782296 -1.067428
H  3.783055 0.789474 -1.238072
H  2.5576 1.005637 -2.500676
H  0.408661 0.642334 2.1830
H  -0.260868 0.788752 0.56527
H  3.99024 0.962999 1.100452
H  2.947713 0.994869 2.515507
H  3.076666 2.418781 1.477955
H  2.975843 -2.762609 -1.473098
H  4.176194 -1.611585 -0.872283
H  3.64671 -1.555329 -2.550347
H  0.160267 -0.289182 -1.771532
H  1.186796 -0.868736 -3.081137
H  0.588154 -2.001502 -1.892312
H  0.928462 3.048175 2.248515
H  0.460535 3.236025 0.570742
H  -1.289839 4.005174 2.154642
H  -1.387246 2.410172 2.86292
H  3.590744 -3.749471 1.614373
H  -0.139316 -2.806597 -0.072314
H  -1.670285 4.104738 -0.477707
H  -2.992479 0.890134 2.007609
H  2.365829 -6.034236 0.699469
H  -3.283284 3.435497 -2.206192
H  -4.608056 0.215409 0.279211
totalener: -1513.49283508 hartree
nucrepener: 2416.20445096 hartree
electener: -3929.69728605 hartree
oneelecener: -6869.27443819 hartree
twoeener: 2939.57715214 hartree
kineticenergy: 1508.19714158 hartree
xcener: -124.308709070158 hartree
chargesum: 0.0000000
charge: -0.084471 -0.329560 -0.366350 -0.074807 -0.030633 -0.293787 0.276185 0.094077 0.072057 -0.193278 -0.328877 -0.320743 -0.350383 -0.128532 0.311442 -0.125078 0.025218 -0.119097 0.002666 -0.170018 -0.149761 -0.080913 -0.136552 -0.130743 0.086355 0.067355 0.089531 0.105847 0.070771 0.085604 0.123666 0.104022 0.113632 0.100399 0.106832 0.122669 0.094038 0.112569 0.080235 0.088470 0.101764 0.082697 0.146099 0.150523 0.110909 0.114995 0.128712 0.120634 0.123608
qa: -0.0845 -0.3296 -0.3664 -0.0748 -0.0306 -0.2938 0.2762 0.0941 0.0721 -0.1933 -0.3289 -0.3207 -0.3504 -0.1285 0.3114 -0.1251 0.0252 -0.1191 0.0027 -0.1700 -0.1498 -0.0809 -0.1366 -0.1307 0.0864 0.0674 0.0895 0.1058 0.0708 0.0856 0.1237 0.1040 0.1136 0.1004 0.1068 0.1227 0.0940 0.1126 0.0802 0.0885 0.1018 0.0827 0.1461 0.1505 0.1109 0.1150 0.1287 0.1206 0.1236
va: 1.2220 2.0178 2.1368 3.0662 3.2597 3.1274 4.1145 3.9585 3.9457 3.8092 3.9478 3.9402 3.9334 3.8393 4.2802 3.8612 3.6366 3.9120 4.0624 4.0115 3.9402 4.0245 4.0192 4.0123 3.9246 1.0022 0.9940 1.0249 1.0311 1.0104 1.0197 1.0041 0.9968 1.0048 1.0060 1.0011 1.0100 1.0046 1.0132 1.0235 1.0044 1.0124 1.0107 0.9940 1.0113 1.0103 1.0087 1.0124 1.0108
dispcorr: -0.028519060 hartree
energy: -1513.521354144089
dipole: 27.25343 -25.96334 1.29009 4.53726 -3.31995 1.21731 4.87338 -5.28704 -0.41366
magnitude: 1.82134 au
magnitude: 4.62948 debye
