program: Orca
programVersion: 4.2.1
elementType: Cl O O N N N C C C C C C C C C C C C C C C C C C C H H H H H H H H H H H H H H H H H H H H H H H H
charge: 0
multiplicity: 1
keywords: wb97x-d3
keywords: def2-TZVPP
keywords: def2/J RIJCOSX GRIDX6 NOFINALGRIDX
keywords: grid4 nofinalgrid
keywords: scfconv7
keywords: smallprint printgap noloewdin
keywords: NOSOSCF
formula: C19H24ClN3O2
InChI: InChI=1S/C19H24ClN3O2/c1-18(2)13-25-19(3,23(18)17(24)22-12-11-21-14-22)10-4-5-15-6-8-16(20)9-7-15/h6-9,11-12,14H,4-5,10,13H2,1-3H3
49 atoms
Cl -5.758657 2.874506 1.405212
O  1.443378 1.212826 0.739497
O  3.356717 -1.933766 -1.6752
N  2.46314 -0.637271 -0.038736
N  1.803746 -2.881615 -0.324966
N  0.461546 -4.615876 -0.550884
C  1.301912 -0.186518 0.788044
C  3.377049 0.495806 -0.307635
C  2.813608 1.502721 0.69462
C  -0.070487 -0.548489 0.222567
C  1.403098 -0.641983 2.245648
C  4.826097 0.156301 0.012596
C  3.241441 1.04967 -1.727205
C  -0.352934 -0.188473 -1.234645
C  2.606602 -1.780497 -0.743039
C  -0.740993 1.270616 -1.510323
C  -1.988624 1.694113 -0.788142
C  1.822594 -3.549366 0.876675
C  0.986942 -3.593867 -1.152341
C  -3.244268 1.358189 -1.286474
C  -1.928685 2.40245 0.408132
C  0.985135 -4.609646 0.710289
C  -4.405876 1.714541 -0.621699
C  -3.080641 2.767893 1.088301
C  -4.315611 2.420459 0.567462
H  3.288091 1.393994 1.679672
H  2.945582 2.534611 0.368891
H  -0.808298 -0.065637 0.869694
H  -0.232734 -1.616154 0.368095
H  2.412744 -0.532024 2.642349
H  1.102445 -1.678864 2.368968
H  0.731699 -0.033108 2.851275
H  5.250996 -0.538006 -0.708597
H  4.916926 -0.279448 1.00843
H  5.429013 1.065897 -0.009579
H  2.213991 1.342482 -1.944423
H  3.86677 1.938281 -1.827883
H  3.560506 0.331334 -2.47647
H  0.499122 -0.4444 -1.871208
H  -1.171946 -0.827149 -1.575415
H  -0.894267 1.37958 -2.587139
H  0.079043 1.93698 -1.24684
H  2.453369 -3.249867 1.694538
H  0.810179 -3.294929 -2.173944
H  -3.321254 0.811147 -2.219048
H  -0.963705 2.67144 0.819894
H  0.741407 -5.375821 1.428693
H  -5.373293 1.450107 -1.025829
H  -3.017338 3.321262 2.015157
totalener: -1513.49127180 hartree
nucrepener: 2440.98076473 hartree
electener: -3954.47203653 hartree
oneelecener: -6918.56305470 hartree
twoeener: 2964.09101817 hartree
kineticenergy: 1508.19360934 hartree
xcener: -124.310625111778 hartree
chargesum: 0.0000000
charge: -0.085911 -0.329585 -0.358094 -0.053528 -0.010558 -0.291649 0.193573 0.112945 0.061609 -0.165418 -0.327543 -0.307559 -0.342710 -0.206027 0.273046 -0.092824 0.061474 -0.165349 0.041087 -0.188003 -0.229890 -0.081196 -0.129603 -0.104793 0.078783 0.071040 0.092649 0.121662 0.124507 0.095305 0.109715 0.113160 0.122491 0.084928 0.099834 0.097996 0.095115 0.127360 0.085239 0.109332 0.100561 0.083630 0.166239 0.135433 0.114871 0.126983 0.129217 0.120468 0.119988
qa: -0.0859 -0.3296 -0.3581 -0.0535 -0.0106 -0.2916 0.1936 0.1129 0.0616 -0.1654 -0.3275 -0.3076 -0.3427 -0.2060 0.2730 -0.0928 0.0615 -0.1653 0.0411 -0.1880 -0.2299 -0.0812 -0.1296 -0.1048 0.0788 0.0710 0.0926 0.1217 0.1245 0.0953 0.1097 0.1132 0.1225 0.0849 0.0998 0.0980 0.0951 0.1274 0.0852 0.1093 0.1006 0.0836 0.1662 0.1354 0.1149 0.1270 0.1292 0.1205 0.1200
va: 1.2205 1.9719 2.1370 3.0551 3.2470 3.1335 4.0962 3.9893 3.9125 3.7313 3.9300 3.9112 3.9150 3.9374 4.2960 3.8152 3.6179 3.9073 4.0548 4.0312 3.9554 4.0602 4.0190 4.0008 3.9294 1.0026 0.9966 1.0100 1.0059 1.0068 1.0085 1.0154 1.0145 1.0084 1.0025 1.0011 1.0072 1.0208 1.0082 1.0047 1.0043 1.0274 0.9907 1.0092 1.0100 1.0257 1.0103 1.0118 1.0124
dispcorr: -0.030885793 hartree
energy: -1513.522157592382
dipole: 30.68567 -29.51129 1.17438 -1.78224 2.96118 1.17894 -3.32284 4.02707 0.70423
magnitude: 1.80693 au
magnitude: 4.59286 debye
