program: Orca
programVersion: 4.2.1
elementType: Cl O O N N N C C C C C C C C C C C C C C C C C C C H H H H H H H H H H H H H H H H H H H H H H H H
charge: 0
multiplicity: 1
keywords: wb97x-d3
keywords: def2-TZVPP
keywords: def2/J RIJCOSX GRIDX6 NOFINALGRIDX
keywords: grid4 nofinalgrid
keywords: scfconv7
keywords: smallprint printgap noloewdin
keywords: NOSOSCF
formula: C19H24ClN3O2
InChI: InChI=1S/C19H24ClN3O2/c1-18(2)13-25-19(3,23(18)17(24)22-12-11-21-14-22)10-4-5-15-6-8-16(20)9-7-15/h6-9,11-12,14H,4-5,10,13H2,1-3H3
49 atoms
Cl -5.525509 1.326411 -1.699711
O  1.474179 1.488613 -0.334535
O  2.459698 -1.572322 2.244647
N  1.850707 -0.657657 0.252978
N  2.153893 -2.971582 0.486153
N  1.369168 -4.840392 -0.382387
C  1.617608 0.702128 0.824731
C  2.001492 -0.579429 -1.221101
C  2.277417 0.921889 -1.329068
C  0.30663 0.709814 1.609582
C  2.801237 1.224625 1.641747
C  3.177639 -1.366736 -1.783265
C  0.7122 -0.9099 -1.97326
C  -0.10741 2.036855 2.242324
C  2.177735 -1.676954 1.076626
C  -0.611215 3.124083 1.285093
C  -1.834658 2.701401 0.519688
C  3.154436 -3.90553 0.600357
C  1.094297 -3.606098 -0.094424
C  -1.764986 2.30667 -0.812484
C  -3.078084 2.663423 1.14534
C  2.656173 -5.036982 0.033146
C  -2.892245 1.884496 -1.501386
C  -4.215267 2.244165 0.4748
C  -4.113867 1.852846 -0.850774
H  3.343925 1.13682 -1.171898
H  1.988457 1.332076 -2.297295
H  0.4089 -0.02146 2.413101
H  -0.489717 0.344359 0.955549
H  2.822093 0.812281 2.645501
H  2.724585 2.30958 1.713844
H  3.755335 0.991574 1.168202
H  3.383922 -1.010963 -2.794451
H  2.984215 -2.434576 -1.856773
H  4.082049 -1.218513 -1.191789
H  0.489289 -1.973627 -1.958112
H  -0.142834 -0.370325 -1.565496
H  0.81757 -0.627801 -3.022173
H  -0.906473 1.815453 2.955227
H  0.711486 2.440285 2.843124
H  0.17723 3.423132 0.595507
H  -0.84985 4.010063 1.879768
H  4.10339 -3.675948 1.052633
H  0.139322 -3.123373 -0.225801
H  -0.811359 2.327055 -1.322686
H  -3.166432 2.97418 2.180101
H  3.152099 -5.985714 -0.0939
H  -2.820638 1.584363 -2.537911
H  -5.173189 2.225688 0.976036
totalener: -1513.49127244 hartree
nucrepener: 2434.55940207 hartree
electener: -3948.05067451 hartree
oneelecener: -6905.85362260 hartree
twoeener: 2957.80294809 hartree
kineticenergy: 1508.19465101 hartree
xcener: -124.309573079100 hartree
chargesum: 0.0000000
charge: -0.085935 -0.333453 -0.365586 -0.073665 -0.028286 -0.291658 0.281833 0.109881 0.040926 -0.224500 -0.332297 -0.318075 -0.341343 -0.174510 0.312452 -0.088989 0.059152 -0.118954 -0.001516 -0.216701 -0.176959 -0.080783 -0.111883 -0.131576 0.083079 0.076755 0.090997 0.122686 0.094325 0.125814 0.102611 0.086722 0.107191 0.114535 0.100553 0.115965 0.105211 0.094078 0.092921 0.086694 0.081871 0.096359 0.148247 0.152850 0.131220 0.113774 0.128942 0.118527 0.120497
qa: -0.0859 -0.3335 -0.3656 -0.0737 -0.0283 -0.2917 0.2818 0.1099 0.0409 -0.2245 -0.3323 -0.3181 -0.3413 -0.1745 0.3125 -0.0890 0.0592 -0.1190 -0.0015 -0.2167 -0.1770 -0.0808 -0.1119 -0.1316 0.0831 0.0768 0.0910 0.1227 0.0943 0.1258 0.1026 0.0867 0.1072 0.1145 0.1006 0.1160 0.1052 0.0941 0.0929 0.0867 0.0819 0.0964 0.1482 0.1528 0.1312 0.1138 0.1289 0.1185 0.1205
va: 1.2208 1.9708 2.1343 3.0650 3.2619 3.1252 4.0152 3.9540 3.9356 3.8706 3.9632 3.9398 3.9310 3.9218 4.2783 3.7970 3.6324 3.9112 4.0638 3.9573 4.0132 4.0242 3.9852 4.0179 3.9295 1.0052 0.9948 1.0212 1.0088 1.0172 1.0014 1.0112 1.0059 0.9973 1.0052 1.0078 1.0052 1.0093 1.0065 1.0094 1.0316 1.0050 1.0103 0.9941 1.0123 1.0091 1.0086 1.0132 1.0116
dispcorr: -0.030290956 hartree
energy: -1513.521563391814
dipole: 26.73826 -25.50916 1.22910 5.12672 -3.80055 1.32618 3.60885 -3.98495 -0.37610
magnitude: 1.84686 au
magnitude: 4.69434 debye
