program: Orca
programVersion: 4.2.1
elementType: Cl O O N N N C C C C C C C C C C C C C C C C C C C H H H H H H H H H H H H H H H H H H H H H H H H
charge: 0
multiplicity: 1
keywords: wb97x-d3
keywords: def2-TZVPP
keywords: def2/J RIJCOSX GRIDX6 NOFINALGRIDX
keywords: grid4 nofinalgrid
keywords: scfconv7
keywords: smallprint printgap noloewdin
keywords: NOSOSCF
formula: C19H24ClN3O2
InChI: InChI=1S/C19H24ClN3O2/c1-18(2)13-25-19(3,23(18)17(24)22-12-11-21-14-22)10-4-5-15-6-8-16(20)9-7-15/h6-9,11-12,14H,4-5,10,13H2,1-3H3
49 atoms
Cl -4.397364 -1.345166 -0.830521
O  3.372899 1.669984 0.228559
O  0.556644 -0.685504 2.104522
N  1.885696 -0.006706 0.385926
N  0.302456 -1.717243 0.104927
N  -0.667422 -3.61634 -0.453755
C  2.399803 1.184408 1.11475
C  2.82301 -0.396878 -0.697345
C  3.981452 0.555987 -0.357794
C  1.317871 2.244533 1.287693
C  3.039525 0.840926 2.462015
C  3.288133 -1.845312 -0.606562
C  2.314827 -0.089255 -2.10395
C  0.77142 2.84792 -0.005307
C  0.925462 -0.769281 0.957808
C  -0.690828 3.305934 0.121562
C  -1.660478 2.17305 -0.079659
C  -0.402203 -1.470727 -1.050968
C  0.073492 -3.023503 0.428978
C  -2.175025 1.916508 -1.348941
C  -2.034052 1.319727 0.954596
C  -0.985701 -2.655818 -1.373765
C  -3.027322 0.850053 -1.585982
C  -2.86955 0.2353 0.732842
C  -3.364644 0.007337 -0.539193
H  4.698262 0.073486 0.320989
H  4.526057 0.877334 -1.246136
H  1.728565 3.042355 1.912897
H  0.520619 1.797309 1.881009
H  3.719063 -0.008986 2.392718
H  2.292585 0.602789 3.212831
H  3.612568 1.703055 2.803977
H  2.530893 -2.551804 -0.941294
H  3.584756 -2.108104 0.409878
H  4.159103 -1.983147 -1.249934
H  1.977479 0.943077 -2.19189
H  3.125966 -0.234714 -2.819288
H  1.505318 -0.750195 -2.402426
H  1.395027 3.692448 -0.302118
H  0.829871 2.128447 -0.824473
H  -0.890667 4.077936 -0.624676
H  -0.850799 3.779521 1.094222
H  -0.478765 -0.486103 -1.477719
H  0.497292 -3.474739 1.312566
H  -1.911092 2.569307 -2.172833
H  -1.670533 1.492361 1.959174
H  -1.637329 -2.863531 -2.2069
H  -3.423497 0.673435 -2.576462
H  -3.128262 -0.428041 1.545929
totalener: -1513.48928497 hartree
nucrepener: 2585.58289191 hartree
electener: -4099.07217688 hartree
oneelecener: -7208.40968650 hartree
twoeener: 3109.33750962 hartree
kineticenergy: 1508.20658184 hartree
xcener: -124.315621747059 hartree
chargesum: -0.0000000
charge: -0.080953 -0.335261 -0.362111 -0.008048 0.037294 -0.282957 0.245757 0.074213 0.093837 -0.226497 -0.308504 -0.339536 -0.359646 -0.097927 0.239546 -0.140082 0.103997 -0.217628 0.023028 -0.219768 -0.176128 -0.064231 -0.136650 -0.126674 0.106308 0.067175 0.088721 0.097017 0.103584 0.080972 0.118518 0.102768 0.118355 0.102723 0.106807 0.125145 0.101099 0.114567 0.091647 0.040073 0.087492 0.094360 0.171898 0.134883 0.109319 0.129632 0.129321 0.119268 0.123277
qa: -0.0810 -0.3353 -0.3621 -0.0080 0.0373 -0.2830 0.2458 0.0742 0.0938 -0.2265 -0.3085 -0.3395 -0.3596 -0.0979 0.2395 -0.1401 0.1040 -0.2176 0.0230 -0.2198 -0.1761 -0.0642 -0.1366 -0.1267 0.1063 0.0672 0.0887 0.0970 0.1036 0.0810 0.1185 0.1028 0.1184 0.1027 0.1068 0.1251 0.1011 0.1146 0.0916 0.0401 0.0875 0.0944 0.1719 0.1349 0.1093 0.1296 0.1293 0.1193 0.1233
va: 1.2241 2.0256 2.1259 3.0400 3.1893 3.1395 4.1423 3.9582 3.8980 3.7735 3.9412 3.9547 3.9109 3.8754 4.2880 3.8887 3.5470 3.9263 4.0616 3.9883 3.9452 4.0497 3.9749 3.9659 3.8703 1.0018 0.9944 1.0181 1.0273 1.0085 1.0189 1.0111 0.9987 1.0017 1.0056 0.9950 1.0097 1.0123 1.0157 1.0280 1.0096 1.0073 0.9815 1.0118 1.0120 1.0031 1.0184 1.0153 1.0144
dispcorr: -0.035044359 hartree
energy: -1513.524329330841
dipole: 31.03324 -29.33383 1.69942 14.00118 -12.61134 1.38983 -0.07862 -0.43145 -0.51007
magnitude: 2.25385 au
magnitude: 5.72882 debye
