program: Orca
programVersion: 4.2.1
elementType: Cl O O N N N C C C C C C C C C C C C C C C C C C C H H H H H H H H H H H H H H H H H H H H H H H H
charge: 0
multiplicity: 1
keywords: wb97x-d3
keywords: def2-TZVPP
keywords: def2/J RIJCOSX GRIDX6 NOFINALGRIDX
keywords: grid4 nofinalgrid
keywords: scfconv7
keywords: smallprint printgap noloewdin
keywords: NOSOSCF
formula: C19H24ClN3O2
InChI: InChI=1S/C19H24ClN3O2/c1-18(2)13-25-19(3,23(18)17(24)22-12-11-21-14-22)10-4-5-15-6-8-16(20)9-7-15/h6-9,11-12,14H,4-5,10,13H2,1-3H3
49 atoms
Cl -5.796122 0.292242 1.067416
O  3.079667 1.632191 0.636761
O  0.322111 -1.361152 1.279081
N  2.065362 -0.336965 0.24111
N  1.181286 -2.362202 -0.563893
N  1.104661 -4.429859 -1.324756
C  1.967757 0.893637 1.075222
C  3.394887 -0.417708 -0.41243
C  4.094344 0.715627 0.352169
C  0.708463 1.702095 0.779973
C  2.090616 0.610542 2.573605
C  4.122454 -1.735047 -0.17563
C  3.369188 -0.074571 -1.90099
C  0.483557 2.043465 -0.68518
C  1.150787 -1.31671 0.404699
C  -0.750121 2.925852 -0.89672
C  -2.024619 2.289064 -0.415693
C  0.979758 -2.272429 -1.920971
C  1.21687 -3.691093 -0.264229
C  -2.554528 1.179606 -1.069317
C  -2.692005 2.763468 0.707286
C  0.939595 -3.559032 -2.36336
C  -3.708835 0.560248 -0.62189
C  -3.850571 2.158296 1.170784
C  -4.352817 1.056202 0.501081
H  4.573145 0.33317 1.2641
H  4.860607 1.207763 -0.247346
H  0.784501 2.627028 1.361302
H  -0.153737 1.166529 1.178996
H  2.235269 1.556209 3.096316
H  2.942094 -0.031976 2.800284
H  1.20038 0.131557 2.968322
H  4.068472 -2.040214 0.870278
H  5.177306 -1.608714 -0.426471
H  3.745322 -2.546474 -0.794725
H  2.935384 -0.870967 -2.49936
H  2.819504 0.84716 -2.089346
H  4.39059 0.066919 -2.257431
H  1.355689 2.562606 -1.087876
H  0.368328 1.126889 -1.271236
H  -0.835836 3.160953 -1.96104
H  -0.602763 3.881319 -0.386375
H  0.831549 -1.331565 -2.420116
H  1.344625 -4.043075 0.747525
H  -2.058916 0.786501 -1.949451
H  -2.30266 3.625005 1.23639
H  0.790081 -3.904195 -3.373885
H  -4.105384 -0.301613 -1.140318
H  -4.356599 2.540893 2.046345
totalener: -1513.49202967 hartree
nucrepener: 2446.33629279 hartree
electener: -3959.82832246 hartree
oneelecener: -6929.58403859 hartree
twoeener: 2969.75571612 hartree
kineticenergy: 1508.20403319 hartree
xcener: -124.310714616370 hartree
chargesum: -0.0000000
charge: -0.084726 -0.332936 -0.355753 -0.064823 -0.014664 -0.292803 0.259991 0.084031 0.085780 -0.186878 -0.303086 -0.335391 -0.352222 -0.110028 0.298035 -0.165240 0.054708 -0.163483 0.040333 -0.194463 -0.148546 -0.085402 -0.108742 -0.124173 0.082442 0.066794 0.088955 0.088850 0.114886 0.102733 0.080538 0.120701 0.103007 0.107425 0.115380 0.110874 0.120961 0.097915 0.086100 0.041647 0.101407 0.082979 0.161627 0.137096 0.108259 0.108565 0.130712 0.120892 0.119737
qa: -0.0847 -0.3329 -0.3558 -0.0648 -0.0147 -0.2928 0.2600 0.0840 0.0858 -0.1869 -0.3031 -0.3354 -0.3522 -0.1100 0.2980 -0.1652 0.0547 -0.1635 0.0403 -0.1945 -0.1485 -0.0854 -0.1087 -0.1242 0.0824 0.0668 0.0890 0.0888 0.1149 0.1027 0.0805 0.1207 0.1030 0.1074 0.1154 0.1109 0.1210 0.0979 0.0861 0.0416 0.1014 0.0830 0.1616 0.1371 0.1083 0.1086 0.1307 0.1209 0.1197
va: 1.2213 2.0333 2.1493 3.0532 3.2455 3.1339 4.1609 3.9427 3.9106 3.7139 3.9325 3.9544 3.9118 3.8834 4.2768 3.8911 3.6103 3.9127 4.0543 4.0071 3.9707 4.0757 4.0197 4.0262 3.9355 1.0032 0.9945 1.0203 1.0240 1.0105 1.0081 1.0217 1.0026 1.0054 0.9970 1.0104 0.9984 1.0120 1.0292 1.0133 1.0043 1.0111 0.9886 1.0103 1.0100 1.0111 1.0105 1.0112 1.0120
dispcorr: -0.029846655 hartree
energy: -1513.521876328532
dipole: 36.28723 -34.41740 1.86983 8.31931 -6.85117 1.46814 -5.66079 5.25454 -0.40624
magnitude: 2.41179 au
magnitude: 6.13029 debye
