program: Orca
programVersion: 4.2.1
elementType: Cl O O N N N C C C C C C C C C C C C C C C C C C C H H H H H H H H H H H H H H H H H H H H H H H H
charge: 0
multiplicity: 1
keywords: wb97x-d3
keywords: def2-TZVPP
keywords: def2/J RIJCOSX GRIDX6 NOFINALGRIDX
keywords: grid4 nofinalgrid
keywords: scfconv7
keywords: smallprint printgap noloewdin
keywords: NOSOSCF
formula: C19H24ClN3O2
InChI: InChI=1S/C19H24ClN3O2/c1-18(2)13-25-19(3,23(18)17(24)22-12-11-21-14-22)10-4-5-15-6-8-16(20)9-7-15/h6-9,11-12,14H,4-5,10,13H2,1-3H3
49 atoms
Cl -4.348443 -0.171498 2.828582
O  2.468907 1.711458 0.301997
O  2.867807 -2.305264 -1.450898
N  2.330135 -0.48402 -0.203414
N  0.666142 -1.878552 -1.130442
N  -1.355152 -2.652488 -0.70572
C  1.492569 0.742337 0.009606
C  3.736977 -0.208745 0.168565
C  3.518754 1.070982 0.971623
C  0.777178 1.184537 -1.26571
C  0.547872 0.604092 1.201157
C  4.335569 -1.308265 1.033194
C  4.619898 0.092709 -1.044121
C  0.17544 2.600316 -1.206175
C  2.050651 -1.572034 -0.951702
C  -1.320717 2.637657 -1.546488
C  -2.153409 1.951439 -0.501094
C  0.096208 -2.174559 -2.34539
C  -0.253466 -2.212445 -0.179323
C  -2.460427 2.606433 0.689579
C  -2.566192 0.631702 -0.644321
C  -1.155792 -2.621003 -2.058001
C  -3.14009 1.966127 1.711057
C  -3.237127 -0.033483 0.372574
C  -3.518294 0.641287 1.547438
H  3.265143 0.847499 2.017245
H  4.391673 1.724069 0.966717
H  -0.008296 0.464427 -1.489001
H  1.492385 1.125658 -2.089822
H  0.197727 1.588596 1.507487
H  1.045151 0.143934 2.055623
H  -0.336508 0.019758 0.964114
H  5.289447 -0.970918 1.442665
H  4.523762 -2.216972 0.466583
H  3.680607 -1.551225 1.870931
H  4.218086 0.921851 -1.627111
H  5.616703 0.378949 -0.704041
H  4.725798 -0.770902 -1.693862
H  0.323566 3.057008 -0.225957
H  0.709853 3.245675 -1.905042
H  -1.487092 2.176481 -2.523499
H  -1.634852 3.67993 -1.642836
H  0.623646 -2.037112 -3.273169
H  -0.04124 -2.143654 0.875202
H  -2.157749 3.638418 0.826556
H  -2.352594 0.09218 -1.559623
H  -1.922013 -2.931915 -2.749928
H  -3.372354 2.489024 2.628695
H  -3.508292 -1.072931 0.250878
totalener: -1513.48967181 hartree
nucrepener: 2521.44835168 hartree
electener: -4034.93802350 hartree
oneelecener: -7079.96452698 hartree
twoeener: 3045.02650348 hartree
kineticenergy: 1508.19426526 hartree
xcener: -124.311785617446 hartree
chargesum: -0.0000000
charge: -0.083034 -0.323950 -0.364560 -0.078482 -0.017373 -0.310894 0.287001 0.118716 0.059756 -0.170313 -0.356404 -0.303398 -0.343716 -0.171455 0.324178 -0.126984 0.140401 -0.097137 0.013283 -0.245180 -0.205509 -0.107256 -0.111194 -0.130085 0.087536 0.065388 0.093748 0.046969 0.105854 0.113612 0.101766 0.092306 0.097268 0.121550 0.086863 0.101724 0.090002 0.120760 0.082288 0.086939 0.089435 0.091900 0.147757 0.152946 0.114289 0.130872 0.129290 0.120246 0.132283
qa: -0.0830 -0.3240 -0.3646 -0.0785 -0.0174 -0.3109 0.2870 0.1187 0.0598 -0.1703 -0.3564 -0.3034 -0.3437 -0.1715 0.3242 -0.1270 0.1404 -0.0971 0.0133 -0.2452 -0.2055 -0.1073 -0.1112 -0.1301 0.0875 0.0654 0.0937 0.0470 0.1059 0.1136 0.1018 0.0923 0.0973 0.1216 0.0869 0.1017 0.0900 0.1208 0.0823 0.0869 0.0894 0.0919 0.1478 0.1529 0.1143 0.1309 0.1293 0.1202 0.1323
va: 1.2235 2.0139 2.1372 3.0623 3.2624 3.0698 4.0227 3.9947 3.9527 3.8587 3.9962 3.9009 3.9157 3.9110 4.2647 3.8270 3.5180 3.8582 4.0203 3.9861 3.9336 3.9903 3.9906 3.9460 3.9228 1.0012 0.9937 1.0294 1.0120 1.0106 1.0147 0.9995 1.0028 1.0145 1.0096 1.0083 1.0052 1.0208 1.0291 1.0170 1.0112 1.0096 1.0120 0.9930 1.0098 1.0041 1.0087 1.0122 1.0330
dispcorr: -0.033242691 hartree
energy: -1513.522914502663
dipole: 27.98828 -26.79335 1.19493 11.03774 -9.60191 1.43583 -9.04104 8.96194 -0.07910
magnitude: 1.86968 au
magnitude: 4.75236 debye
