program: Orca
programVersion: 4.2.1
elementType: Cl O O N N N C C C C C C C C C C C C C C C C C C C H H H H H H H H H H H H H H H H H H H H H H H H
charge: 0
multiplicity: 1
keywords: wb97x-d3
keywords: def2-TZVPP
keywords: def2/J RIJCOSX GRIDX6 NOFINALGRIDX
keywords: grid4 nofinalgrid
keywords: scfconv7
keywords: smallprint printgap noloewdin
keywords: NOSOSCF
formula: C19H24ClN3O2
InChI: InChI=1S/C19H24ClN3O2/c1-18(2)13-25-19(3,23(18)17(24)22-12-11-21-14-22)10-4-5-15-6-8-16(20)9-7-15/h6-9,11-12,14H,4-5,10,13H2,1-3H3
49 atoms
Cl -4.433658 -0.561438 2.669522
O  2.508491 1.617262 0.596775
O  2.863939 -2.083988 -1.755979
N  2.343985 -0.470768 -0.243349
N  0.666449 -1.68115 -1.381579
N  -1.364675 -2.490824 -1.091883
C  1.521203 0.717396 0.157421
C  3.751985 -0.277353 0.173454
C  3.548631 0.869272 1.16098
C  0.813411 1.364604 -1.030765
C  0.570959 0.405598 1.313077
C  4.3256 -1.505834 0.86391
C  4.648199 0.189175 -0.975573
C  0.228124 2.759089 -0.742984
C  2.053846 -1.426343 -1.151312
C  -1.257426 2.877517 -1.110459
C  -2.125506 2.042574 -0.212333
C  0.102149 -1.781563 -2.630696
C  -0.262877 -2.147686 -0.498098
C  -2.537829 0.765304 -0.574824
C  -2.466697 2.502975 1.057399
C  -1.155109 -2.256161 -2.422312
C  -3.242507 -0.047182 0.302553
C  -3.181309 1.71484 1.942768
C  -3.559295 0.435995 1.559804
H  3.292338 0.494574 2.16178
H  4.430437 1.503633 1.252921
H  0.019963 0.698855 -1.367576
H  1.528559 1.431033 -1.854438
H  -0.332741 -0.098182 0.982136
H  0.254781 1.332484 1.789104
H  1.050979 -0.213271 2.071809
H  3.663627 -1.857201 1.656606
H  5.285673 -1.254367 1.318065
H  4.494788 -2.323535 0.16744
H  5.644271 0.412999 -0.589822
H  4.752153 -0.570383 -1.744839
H  4.258704 1.09873 -1.433757
H  0.351451 3.035212 0.3058
H  0.790703 3.507111 -1.303576
H  -1.40269 2.585619 -2.153903
H  -1.556192 3.926374 -1.041304
H  0.637076 -1.508863 -3.523589
H  -0.058393 -2.242779 0.555906
H  -2.297407 0.377063 -1.557639
H  -2.165986 3.497854 1.365762
H  -1.919043 -2.450266 -3.157994
H  -3.512432 -1.052254 0.009742
H  -3.441273 2.088042 2.923873
totalener: -1513.48966580 hartree
nucrepener: 2519.60754707 hartree
electener: -4033.09721288 hartree
oneelecener: -7076.28706951 hartree
twoeener: 3043.18985664 hartree
kineticenergy: 1508.19276181 hartree
xcener: -124.311167138319 hartree
chargesum: -0.0000000
charge: -0.083414 -0.323629 -0.365088 -0.079383 -0.017569 -0.310844 0.285666 0.120313 0.060420 -0.171833 -0.357026 -0.305203 -0.344148 -0.172805 0.326047 -0.124221 0.137522 -0.097043 0.011622 -0.211917 -0.238683 -0.106867 -0.124862 -0.113913 0.087197 0.065644 0.093365 0.047205 0.105899 0.096020 0.111796 0.101629 0.086594 0.097697 0.122239 0.089915 0.120964 0.101654 0.082975 0.087529 0.089277 0.090862 0.147827 0.153440 0.131582 0.113557 0.129339 0.132524 0.120127
qa: -0.0834 -0.3236 -0.3651 -0.0794 -0.0176 -0.3108 0.2857 0.1203 0.0604 -0.1718 -0.3570 -0.3052 -0.3441 -0.1728 0.3260 -0.1242 0.1375 -0.0970 0.0116 -0.2119 -0.2387 -0.1069 -0.1249 -0.1139 0.0872 0.0656 0.0934 0.0472 0.1059 0.0960 0.1118 0.1016 0.0866 0.0977 0.1222 0.0899 0.1210 0.1017 0.0830 0.0875 0.0893 0.0909 0.1478 0.1534 0.1316 0.1136 0.1293 0.1325 0.1201
va: 1.2231 2.0160 2.1367 3.0655 3.2627 3.0687 4.0199 3.9948 3.9499 3.8577 3.9894 3.9023 3.9156 3.9131 4.2651 3.8287 3.5292 3.8584 4.0214 3.9378 3.9860 3.9903 3.9455 3.9927 3.9250 1.0010 0.9937 1.0302 1.0126 0.9994 1.0121 1.0136 1.0095 1.0026 1.0142 1.0051 1.0211 1.0081 1.0289 1.0169 1.0112 1.0100 1.0121 0.9932 1.0041 1.0099 1.0085 1.0331 1.0125
dispcorr: -0.033175582 hartree
energy: -1513.522841383889
dipole: 28.50902 -27.27828 1.23074 11.98358 -10.56882 1.41475 -6.64560 6.81253 0.16693
magnitude: 1.88258 au
magnitude: 4.78513 debye
