program: Gaussian 09
title: 000034443
version: EM64L-G09RevD.01
frameworkgroup: C1[X(C10H8ClNO3)]
method: RPBEPBE
basis: SDD
operation: Freq
keyword: #p
keyword: freq=noraman
keyword: PBEPBE/SDD
title: #p freq=noraman PBEPBE/SDD
converged: YES YES NO YES
title: Mulliken charges:
elementType: Cl O O O N C C C C C C C C C C H H H H H H H H
charge: -0.046779 -0.245846 -0.160660 -0.230340 -0.096906 -0.056212 -0.483923 -0.296899 0.175028 0.108041 0.227987 -0.305858 -0.347738 -0.121611 -0.183772 0.269339 0.242985 0.267186 0.243710 0.222818 0.294809 0.262330 0.262310
chargesum: 0.00000
title: Mulliken charges with hydrogens summed into heavy atoms:
elementType: Cl O O O N C C C C C C C C C C
charge: -0.046779 -0.245846 -0.160660 -0.230340 -0.096906 0.213127 0.026248 0.169629 0.175028 0.108041 0.227987 -0.011049 -0.085408 -0.121611 0.078538
polarizability: 2.09608829e+02 3.46119184e+00 1.30347723e+02 1.64447534e+00 -1.54490463e+00 6.53273720e+01
1716.lowfreq: -4.9763 -0.0007 0.0007 0.0025 5.5925 8.9344 55.5591 79.7170 125.0463
frequency: 55.5567 79.7167 125.0458 148.1204 157.2394 175.6795 229.0712 264.5080 305.0318 326.8015 341.1113 414.7019 427.2951 460.5587 500.0093 521.5092 583.4537 613.9214 636.4546 661.2713 670.5698 722.5702 748.1637 814.0625 825.2669 852.0578 865.5451 889.5378 913.7655 938.6988 952.3438 983.1337 1023.8190 1067.0203 1087.2552 1097.8990 1116.4731 1161.1208 1177.7208 1189.3939 1203.2723 1245.4468 1272.8738 1291.6254 1299.4571 1334.7577 1363.0872 1377.7495 1403.8910 1449.5133 1460.1847 1469.9346 1567.1406 1603.0277 1617.7576 2995.2996 3004.0137 3045.8415 3113.9107 3125.2468 3163.4471 3169.9560 3182.4109
redmass: 7.5398 3.9896 6.3772 7.7899 7.7342 5.6575 3.3936 4.5193 11.1111 7.3992 6.6455 4.6630 6.0312 5.0662 7.3586 3.9882 3.0200 4.2633 6.5866 8.4206 7.0063 4.6728 4.5291 3.5773 1.8018 3.4742 2.7433 3.9236 1.4690 3.1084 1.3495 3.3058 2.4992 1.9711 3.6782 2.5100 2.6729 1.7511 1.6206 1.8418 1.8388 1.3871 1.8694 1.7178 1.3102 1.2734 1.8712 5.0880 4.5879 2.6306 1.1003 1.0962 7.9339 8.8622 10.2074 1.0856 1.0669 1.0610 1.1011 1.1056 1.0888 1.0927 1.0977
irintensity: 2.7215 1.0718 2.7844 3.5315 5.6112 3.0448 6.4335 4.3889 0.8423 1.1327 1.8905 7.5600 2.8477 0.3424 2.8279 21.8804 4.4507 10.1902 8.8883 56.9674 43.1537 7.5625 4.9609 24.4133 33.0465 37.2878 25.7568 25.2169 14.2142 2.8086 1.4996 42.4842 19.7123 6.9280 114.7948 24.3235 1.2021 39.9091 1.8213 2.9646 6.1173 1.1541 116.5587 30.1909 9.1710 6.4170 87.8941 10.3945 66.8628 122.3186 11.1319 1.8159 18.5598 99.0385 182.3581 23.5457 82.6749 7.9845 10.4953 18.2582 0.9431 2.7578 2.8404
temp: 298.150 k
press: 1.00000 atm
elementType: 17 8 8 8 7 6 6 6 6 6 6 6 6 6 6 1 1 1 1 1 1 1 1
symmnumber: 1
zpe: 429957.7 jmol-1
zpe.correction: 0.163762 hartree
zpe.thermalcorrener: 0.175924 hartree
zpe.thermalcorrenthalpy: 0.176869 hartree
zpe.thermalcorrgfe: 0.124802 hartree
zpe.sumelectzpe: -1125.210600 hartree
zpe.sumelectthermal: -1125.198438 hartree
zpe.sumelectthermalent: -1125.197494 hartree
zpe.sumelectthermalfe: -1125.249560 hartree
dipole: 3.6117 5.4890 1.9242
dipole: 6.8467
quadrupole: -77.5927 -100.3792 -93.1675
quadrupole: 4.5361 4.9392 -2.0848
quadrupole: 12.7871 -9.9994 -2.7877 4.5361 4.9392 -2.0848
hfenergy: -1125.3743627 hartree
pointgroup: C01 [X(C10H8Cl1N1O3)]
dipole: -1.3083733 -2.2477747 0.7011503 debye
dipolederiv: -0.7933709 -0.2147883 -0.0570944 -0.2820668 -0.201066 -0.0311628 -0.0724535 -0.0303171 -0.0701118 -1.4329974 -0.112478 0.0378145 -0.2014751 -0.4543575 0.0393897 0.0098365 -0.0966752 -0.3131633 -0.8668626 -0.0897297 0.0980695 -0.0721906 -0.3046059 0.0216652 -0.2675534 -0.0577624 -0.1627867 -0.5698972 0.0458469 0.0287593 -0.1482995 -1.065455 0.1270557 0.089989 0.1594788 -0.3721102 -0.4082207 -0.4186483 0.2426964 -0.3491125 -0.6155998 0.1054526 0.6975124 0.1586987 -0.2894364 0.8212829 -0.0860042 -0.1222613 -0.2170265 0.5937669 -0.0795559 -0.387875 -0.0780047 0.5834819 -0.1491972 0.0748846 -0.0474378 0.0258045 -0.0244875 -0.0254793 0.0070271 0.0034555 0.0769559 0.5890669 0.0319272 -0.0804477 0.269574 0.3221237 -0.0303403 -0.2737426 0.0135444 0.3660929 1.3945571 0.0827615 -0.2018341 0.2333423 1.3382137 -0.2127084 -0.2879144 -0.1874974 0.2775306 -0.417078 0.2276484 0.033893 0.0117834 -0.2232054 0.0245872 -0.0506005 -0.0411056 -0.0434816 0.9950075 0.2867181 0.0303142 0.3274965 0.191908 -0.0297921 0.1601457 0.0162507 0.0544222 -0.1411505 -0.2040551 -0.0430312 0.0280264 0.0007195 0.0147619 -0.014096 -0.0117166 -0.0499836 -0.2801806 -0.0900388 -0.0175975 0.0290237 0.0696017 0.0489489 0.0299438 0.070966 -0.1459095 1.110301 0.4445755 0.1135794 0.5192964 0.0747629 0.0458877 0.1246832 0.0505475 -0.0755594 -0.1735769 -0.0348186 -0.0061778 -0.1119631 0.0555033 0.0232481 -0.036376 0.0190408 -0.083734 0.0093827 0.031511 -0.0660097 0.0478367 -0.0137057 0.0154094 0.0603062 0.0495497 -0.1283561 0.0643462 -0.051902 0.037137 -0.0848514 -0.0060532 0.0736825 0.0757833 0.0987616 0.0312886 0.0883186 0.0437666 0.0275245 0.0238398 0.0657718 -0.0392516 -0.0019575 -0.0685612 -0.0348959 -0.065594 -0.0092379 -0.0541224 -0.0145523 0.0926697 0.0105095 -0.0956592 0.0174594 0.0268861 0.0075923 -0.0001184 0.0479475 -0.0404811 0.0119579 -0.0338102 0.2062228 -0.0272296 -0.1333447 0.1393951 0.0095977 0.0000845 -0.0401581 0.0528591 -0.0209554 0.0128835 -0.0121156 0.1588507 0.0781515 -0.0369842 -0.009308 -0.0118223 -0.0309666 -0.0334556 0.006527 -0.0250552 0.1673816 0.0007245 0.0695661 0.0075021 0.0579754 0.0696445 -0.0140868 0.0073678 -0.0217128 0.1599828 unknown
polarizability: 208.9231965|8.0632848|130.9898404|1.7846136|2.3665723|65.3708868 unknown
InChI: InChI=1S/C10H8ClNO3/c11-6-1-2-8-7(5-6)10(13)12-9(15-8)3-4-14-12/h1-2,5,9H,3-4H2
charge 0 multiplicity 1
23 atoms
Cl 4.718183 0.875034 0.285893
O  -0.74859 -1.612863 -0.280809
O  -2.995623 1.053057 -0.430295
O  -0.501885 2.528452 -0.308532
N  -1.73705 0.578938 0.173586
C  -1.775611 -0.861682 0.476761
C  -3.190373 -1.293988 0.051331
C  -3.971176 0.038224 0.057629
C  -0.56031 1.300752 -0.024066
C  0.641928 0.398187 0.081256
C  0.524639 -1.005613 -0.134491
C  1.929016 0.97306 0.206942
C  1.667718 -1.820492 -0.260208
C  3.057889 0.14567 0.113419
C  2.947443 -1.241821 -0.129657
H  -1.553196 -1.018269 1.550244
H  -3.622377 -2.045595 0.729251
H  -3.125427 -1.714186 -0.965982
H  -4.807168 0.070876 -0.657024
H  -4.315569 0.313166 1.072812
H  2.008848 2.056425 0.337688
H  1.548945 -2.89147 -0.44577
H  3.845346 -1.860764 -0.211178
