program: Orca
programVersion: 4.2.1
elementType: Cl Cl S O N N N C C C C C C C C C C C C C C H H H H H H H H H H H H H H H
charge: 0
multiplicity: 1
keywords: wb97x-d3
keywords: def2-TZVPP
keywords: def2/J RIJCOSX GRIDX6 NOFINALGRIDX
keywords: grid4 nofinalgrid
keywords: scfconv7
keywords: smallprint printgap noloewdin
keywords: NOSOSCF
formula: C14H15Cl2N3OS
InChI: InChI=1S/C14H15Cl2N3OS/c15-11-4-2-1-3-10(11)7-14(20,13(16)5-6-13)8-19-12(21)17-9-18-19/h1-4,9,18,20H,5-8H2
36 atoms
Cl -1.367982 -2.91179 -0.520698
Cl 2.775017 -0.120476 2.551178
S  -1.716652 2.832197 -0.120396
O  -0.00531 0.420543 1.185208
N  -1.904571 0.412304 -1.233575
N  -2.815673 -0.342651 -1.906354
N  -3.779466 1.559989 -1.376459
C  -1.124694 -1.59077 0.6614
C  -1.204499 -1.981638 2.094364
C  -2.322261 -1.204192 1.462674
C  -0.095006 -0.555089 0.197851
C  -0.509387 0.045341 -1.158718
C  1.285904 -1.237935 0.064809
C  2.404641 -0.260582 -0.141999
C  3.106468 0.321864 0.912536
C  2.781824 0.105019 -1.432675
C  -2.48758 1.599133 -0.922926
C  -3.938869 0.390076 -1.907349
C  4.118249 1.244105 0.688602
C  3.786158 1.02691 -1.674304
C  4.452853 1.603743 -0.60563
H  -0.544877 -1.464809 2.779205
H  -1.377462 -3.024106 2.324386
H  -3.250481 -1.725471 1.268641
H  -2.436728 -0.160934 1.727101
H  -0.309631 -0.652629 -1.971478
H  0.072038 0.950672 -1.350976
H  1.269777 -1.952185 -0.760602
H  1.457524 -1.822334 0.96993
H  -0.436509 1.251765 0.905615
H  -2.736021 -1.351376 -1.861535
H  2.275007 -0.357133 -2.27211
H  -4.857788 0.013302 -2.33254
H  4.641581 1.67723 1.529687
H  4.048955 1.288273 -2.690375
H  5.240196 2.326071 -0.77368
totalener: -2100.64065020 hartree
nucrepener: 2210.97541621 hartree
electener: -4311.61606640 hartree
oneelecener: -7282.09906984 hartree
twoeener: 2970.48300343 hartree
kineticenergy: 2095.32543289 hartree
xcener: -137.609091507667 hartree
chargesum: 0.0000000
charge: -0.156630 -0.076766 -0.356253 -0.398325 0.075054 -0.121563 -0.274513 -0.030537 -0.157842 -0.168831 0.569409 -0.394155 -0.257577 0.139199 -0.005976 -0.210276 0.133272 0.124736 -0.130730 -0.122754 -0.127869 0.099640 0.093629 0.088504 0.098787 0.135068 0.160667 0.117854 0.123196 0.197338 0.193518 0.116021 0.153975 0.115887 0.127103 0.127743
qa: -0.1566 -0.0768 -0.3563 -0.3983 0.0751 -0.1216 -0.2745 -0.0305 -0.1578 -0.1688 0.5694 -0.3942 -0.2576 0.1392 -0.0060 -0.2103 0.1333 0.1247 -0.1307 -0.1228 -0.1279 0.0996 0.0936 0.0885 0.0988 0.1351 0.1607 0.1179 0.1232 0.1973 0.1935 0.1160 0.1540 0.1159 0.1271 0.1277
va: 1.1904 1.2477 2.0727 2.0440 3.1353 3.2880 3.0294 3.8590 3.9666 3.9362 3.4029 4.0005 3.7789 3.3815 4.0512 3.9553 4.3431 4.0309 4.0250 3.9987 3.9818 1.0410 1.0323 1.0317 1.0424 1.0040 1.0196 1.0259 1.0258 1.1319 1.0472 1.0055 0.9896 1.0152 1.0001 0.9989
dispcorr: -0.023415381 hartree
energy: -2100.664065578175
dipole: 0.91657 -1.08463 -0.16806 -0.75321 -1.40134 -2.15456 -5.08755 3.66554 -1.42201
magnitude: 2.58698 au
magnitude: 6.57558 debye
